[gs-regression] gs regression report - 2002-10-20

regression@casper.ghostscript.com regression@casper.ghostscript.com
Sun, 20 Oct 2002 05:29:41 -0700


The following regression changes happened since yesterday's report:


The complete list of regressions for today:
Checking BEST8-99-Path.fh7.pdf (pkmraw/72dpi/noband) against baseline ... DIFFER
Checking BEST8-99-Path.fh7.pdf (pkmraw/72dpi/banded) against baseline ... DIFFER
Checking BEST8-99-Path.fh7.pdf (pkmraw/300dpi/noband) against baseline ... DIFFER
Checking BEST8-99-Path.fh7.pdf (pkmraw/300dpi/banded) against baseline ... DIFFER
Checking Original.pdf (pkmraw/72dpi/noband) against baseline ... DIFFER
Checking Original.pdf (pkmraw/72dpi/banded) against baseline ... DIFFER
Checking Original.pdf (pkmraw/300dpi/noband) against baseline ... DIFFER
Checking Original.pdf (pkmraw/300dpi/banded) against baseline ... DIFFER
Checking pdfwrite of 000040cf.000_60.pdf (ppmraw/72dpi/noband) against baseline ... DIFFER
Checking pdfwrite of 000040cf.000_60.pdf (ppmraw/300dpi/noband) against baseline ... DIFFER
Checking pdfwrite of 000040cf.000_60.pdf (pkmraw/300dpi/noband) against baseline ... DIFFER
Checking pdfwrite of 01_001.pdf (ppmraw/300dpi/noband) against baseline ... DIFFER
Checking pdfwrite of 01_001.pdf (pkmraw/300dpi/noband) against baseline ... DIFFER
Checking pdfwrite of 1_pct_50_bang.pdf (ppmraw/72dpi/noband) against baseline ... DIFFER
Checking pdfwrite of 1_pct_50_bang.pdf (ppmraw/300dpi/noband) against baseline ... DIFFER
Checking pdfwrite of 1_pct_50_bang.pdf (pkmraw/300dpi/noband) against baseline ... DIFFER
Checking pdfwrite of 298-05.ps (ppmraw/300dpi/noband) against baseline ... DIFFER
Checking pdfwrite of 298-05.ps (pkmraw/300dpi/noband) against baseline ... DIFFER
Checking pdfwrite of 321-05.ps (ppmraw/300dpi/noband) against baseline ... DIFFER
Checking pdfwrite of 321-05.ps (pkmraw/300dpi/noband) against baseline ... DIFFER
Checking pdfwrite of 446-01.ps (ppmraw/72dpi/noband) against baseline ... DIFFER
Checking pdfwrite of 446-01.ps (ppmraw/300dpi/noband) against baseline ... DIFFER
Checking pdfwrite of 446-01.ps (pkmraw/300dpi/noband) against baseline ... DIFFER
Checking pdfwrite of 477-04.ps (ppmraw/72dpi/noband) against baseline ... DIFFER
Checking pdfwrite of 477-04.ps (ppmraw/300dpi/noband) against baseline ... DIFFER
Checking pdfwrite of 477-04.ps (pkmraw/300dpi/noband) against baseline ... DIFFER
Checking pdfwrite of 541.pdf (ppmraw/72dpi/noband) against baseline ... DIFFER
Checking pdfwrite of 541.pdf (ppmraw/300dpi/noband) against baseline ... DIFFER
Checking pdfwrite of 541.pdf (pkmraw/300dpi/noband) against baseline ... DIFFER
Checking pdfwrite of 541_623.pdf (ppmraw/72dpi/noband) against baseline ... DIFFER
Checking pdfwrite of 541_623.pdf (ppmraw/300dpi/noband) against baseline ... DIFFER
Checking pdfwrite of 541_623.pdf (pkmraw/300dpi/noband) against baseline ... DIFFER
Checking pdfwrite of 86554321.pdf (ppmraw/72dpi/noband) against baseline ... DIFFER
Checking pdfwrite of 86554321.pdf (ppmraw/300dpi/noband) against baseline ... DIFFER
Checking pdfwrite of 86554321.pdf (pkmraw/300dpi/noband) against baseline ... DIFFER
Checking pdfwrite of ADOBE1-4.pdf (ppmraw/72dpi/noband) against baseline ... DIFFER
Checking pdfwrite of ADOBE1-4.pdf (ppmraw/300dpi/noband) against baseline ... DIFFER
Checking pdfwrite of ADOBE1-4.pdf (pkmraw/300dpi/noband) against baseline ... DIFFER
Checking pdfwrite of AdobeLic.pdf (ppmraw/72dpi/noband) against baseline ... DIFFER
Checking pdfwrite of AdobeLic.pdf (ppmraw/300dpi/noband) against baseline ... DIFFER
Checking pdfwrite of AdobeLic.pdf (pkmraw/300dpi/noband) against baseline ... DIFFER
Checking pdfwrite of Dave_Barry.pdf (ppmraw/72dpi/noband) against baseline ... DIFFER
Checking pdfwrite of Dave_Barry.pdf (ppmraw/300dpi/noband) against baseline ... DIFFER
Checking pdfwrite of Dave_Barry.pdf (pkmraw/300dpi/noband) against baseline ... DIFFER
Checking pdfwrite of DisplayedGood.pdf (ppmraw/72dpi/noband) against baseline ... DIFFER
Checking pdfwrite of DisplayedGood.pdf (ppmraw/300dpi/noband) against baseline ... DIFFER
Checking pdfwrite of DisplayedGood.pdf (pkmraw/300dpi/noband) against baseline ... DIFFER
Checking pdfwrite of DisplayedWrong.pdf (ppmraw/72dpi/noband) against baseline ... DIFFER
Checking pdfwrite of DisplayedWrong.pdf (ppmraw/300dpi/noband) against baseline ... DIFFER
Checking pdfwrite of DisplayedWrong.pdf (pkmraw/300dpi/noband) against baseline ... DIFFER
Checking pdfwrite of Fixed_Original.pdf (ppmraw/300dpi/noband) against baseline ... DIFFER
Checking pdfwrite of Popafinalrep.pdf (ppmraw/72dpi/noband) against baseline ... DIFFER
Checking pdfwrite of Popafinalrep.pdf (ppmraw/300dpi/noband) against baseline ... DIFFER
Checking pdfwrite of Popafinalrep.pdf (pkmraw/300dpi/noband) against baseline ... DIFFER
Checking pdfwrite of QA_Inv.pdf (ppmraw/72dpi/noband) against baseline ... DIFFER
Checking pdfwrite of QA_Inv.pdf (ppmraw/300dpi/noband) against baseline ... DIFFER
Checking pdfwrite of QA_Inv.pdf (pkmraw/300dpi/noband) against baseline ... DIFFER
Checking pdfwrite of RealCities.pdf (ppmraw/72dpi/noband) against baseline ... DIFFER
Checking pdfwrite of RealCities.pdf (ppmraw/300dpi/noband) against baseline ... DIFFER
Checking pdfwrite of RealCities.pdf (pkmraw/300dpi/noband) against baseline ... DIFFER
Checking pdfwrite of Vu989qfj.pdf (ppmraw/72dpi/noband) against baseline ... DIFFER
Checking pdfwrite of Vu989qfj.pdf (ppmraw/300dpi/noband) against baseline ... DIFFER
Checking pdfwrite of Vu989qfj.pdf (pkmraw/300dpi/noband) against baseline ... DIFFER
Checking pdfwrite of adesso2.pdf (ppmraw/72dpi/noband) against baseline ... DIFFER
Checking pdfwrite of adesso2.pdf (ppmraw/300dpi/noband) against baseline ... DIFFER
Checking pdfwrite of adesso2.pdf (pkmraw/300dpi/noband) against baseline ... DIFFER
Checking pdfwrite of adesso5.pdf (ppmraw/72dpi/noband) against baseline ... DIFFER
Checking pdfwrite of adesso5.pdf (ppmraw/300dpi/noband) against baseline ... DIFFER
Checking pdfwrite of adesso5.pdf (pkmraw/300dpi/noband) against baseline ... DIFFER
Checking pdfwrite of adesso7.pdf (ppmraw/72dpi/noband) against baseline ... DIFFER
Checking pdfwrite of adesso7.pdf (ppmraw/300dpi/noband) against baseline ... DIFFER
Checking pdfwrite of adesso7.pdf (pkmraw/300dpi/noband) against baseline ... DIFFER
Checking pdfwrite of adesso8.pdf (ppmraw/72dpi/noband) against baseline ... DIFFER
Checking pdfwrite of adesso8.pdf (ppmraw/300dpi/noband) against baseline ... DIFFER
Checking pdfwrite of adesso8.pdf (pkmraw/300dpi/noband) against baseline ... DIFFER
Checking pdfwrite of bc_02a01_cal.pdf (ppmraw/300dpi/noband) against baseline ... DIFFER
Checking pdfwrite of bc_02a01_cal.pdf (pkmraw/300dpi/noband) against baseline ... DIFFER
Checking pdfwrite of besttest.pdf (ppmraw/72dpi/noband) against baseline ... DIFFER
Checking pdfwrite of besttest.pdf (ppmraw/300dpi/noband) against baseline ... DIFFER
Checking pdfwrite of besttest.pdf (pkmraw/300dpi/noband) against baseline ... DIFFER
Checking pdfwrite of ca.pdf (ppmraw/72dpi/noband) against baseline ... DIFFER
Checking pdfwrite of ca.pdf (ppmraw/300dpi/noband) against baseline ... DIFFER
Checking pdfwrite of ca.pdf (pkmraw/300dpi/noband) against baseline ... DIFFER
Checking pdfwrite of foo.pdf (ppmraw/300dpi/noband) against baseline ... DIFFER
Checking pdfwrite of foo.pdf (pkmraw/300dpi/noband) against baseline ... DIFFER
Checking pdfwrite of gs.anotherfailure.pdf (ppmraw/72dpi/noband) against baseline ... DIFFER
Checking pdfwrite of gs.anotherfailure.pdf (ppmraw/300dpi/noband) against baseline ... DIFFER
Checking pdfwrite of gs.anotherfailure.pdf (pkmraw/300dpi/noband) against baseline ... DIFFER
Checking pdfwrite of gs5.98-dragon.pdf (ppmraw/72dpi/noband) against baseline ... DIFFER
Checking pdfwrite of gs5.98-dragon.pdf (ppmraw/300dpi/noband) against baseline ... DIFFER
Checking pdfwrite of gs5.98-dragon.pdf (pkmraw/300dpi/noband) against baseline ... DIFFER
Checking pdfwrite of js.pdf (ppmraw/300dpi/noband) against baseline ... DIFFER
Checking pdfwrite of js.pdf (pkmraw/300dpi/noband) against baseline ... DIFFER
Checking pdfwrite of kazmir.pdf (ppmraw/72dpi/noband) against baseline ... DIFFER
Checking pdfwrite of kazmir.pdf (ppmraw/300dpi/noband) against baseline ... DIFFER
Checking pdfwrite of kazmir.pdf (pkmraw/300dpi/noband) against baseline ... DIFFER
Checking pdfwrite of knight.pdf (ppmraw/300dpi/noband) against baseline ... DIFFER
Checking pdfwrite of knight.pdf (pkmraw/300dpi/noband) against baseline ... DIFFER
Checking pdfwrite of messenger.pdf (ppmraw/72dpi/noband) against baseline ... DIFFER
Checking pdfwrite of messenger.pdf (ppmraw/300dpi/noband) against baseline ... DIFFER
Checking pdfwrite of messenger.pdf (pkmraw/300dpi/noband) against baseline ... DIFFER
Checking pdfwrite of messenger16.pdf (ppmraw/72dpi/noband) against baseline ... DIFFER
Checking pdfwrite of messenger16.pdf (ppmraw/300dpi/noband) against baseline ... DIFFER
Checking pdfwrite of messenger16.pdf (pkmraw/300dpi/noband) against baseline ... DIFFER
Checking pdfwrite of mspro.pdf (ppmraw/72dpi/noband) against baseline ... DIFFER
Checking pdfwrite of mspro.pdf (ppmraw/300dpi/noband) against baseline ... DIFFER
Checking pdfwrite of mspro.pdf (pkmraw/300dpi/noband) against baseline ... DIFFER
Checking pdfwrite of new_rect.pdf (ppmraw/72dpi/noband) against baseline ... DIFFER
Checking pdfwrite of new_rect.pdf (ppmraw/300dpi/noband) against baseline ... DIFFER
Checking pdfwrite of new_rect.pdf (pkmraw/300dpi/noband) against baseline ... DIFFER
Checking pdfwrite of new_rect_nr.pdf (ppmraw/72dpi/noband) against baseline ... DIFFER
Checking pdfwrite of new_rect_nr.pdf (ppmraw/300dpi/noband) against baseline ... DIFFER
Checking pdfwrite of new_rect_nr.pdf (pkmraw/300dpi/noband) against baseline ... DIFFER
Checking pdfwrite of bla.ps (ppmraw/72dpi/noband) against baseline ... ERROR
Checking pdfwrite of bla.ps (ppmraw/300dpi/noband) against baseline ... ERROR
Checking pdfwrite of bla.ps (pkmraw/300dpi/noband) against baseline ... ERROR
Checking pdfwrite of p2b-100.pdf (ppmraw/72dpi/noband) against baseline ... DIFFER
Checking pdfwrite of p2b-100.pdf (ppmraw/300dpi/noband) against baseline ... DIFFER
Checking pdfwrite of p2b-100.pdf (pkmraw/300dpi/noband) against baseline ... DIFFER
Checking pdfwrite of pdftops.pdf (ppmraw/72dpi/noband) against baseline ... DIFFER
Checking pdfwrite of pdftops.pdf (ppmraw/300dpi/noband) against baseline ... DIFFER
Checking pdfwrite of pdftops.pdf (pkmraw/300dpi/noband) against baseline ... DIFFER
Checking pdfwrite of spec_gs.pdf (ppmraw/72dpi/noband) against baseline ... DIFFER
Checking pdfwrite of spec_gs.pdf (ppmraw/300dpi/noband) against baseline ... DIFFER
Checking pdfwrite of spec_gs.pdf (pkmraw/300dpi/noband) against baseline ... DIFFER
Checking pdfwrite of spec_gv.pdf (ppmraw/72dpi/noband) against baseline ... DIFFER
Checking pdfwrite of spec_gv.pdf (ppmraw/300dpi/noband) against baseline ... DIFFER
Checking pdfwrite of spec_gv.pdf (pkmraw/300dpi/noband) against baseline ... DIFFER
Checking pdfwrite of test-hyperref.pdf (ppmraw/300dpi/noband) against baseline ... DIFFER
Checking pdfwrite of test-hyperref.pdf (pkmraw/300dpi/noband) against baseline ... DIFFER
Checking pdfwrite of test2.pdf (ppmraw/72dpi/noband) against baseline ... DIFFER
Checking pdfwrite of test2a.pdf (ppmraw/72dpi/noband) against baseline ... DIFFER
Checking pdfwrite of test3.pdf (ppmraw/72dpi/noband) against baseline ... DIFFER
Checking pdfwrite of test3.pdf (ppmraw/300dpi/noband) against baseline ... DIFFER
Checking pdfwrite of test3.pdf (pkmraw/300dpi/noband) against baseline ... DIFFER
Checking pdfwrite of textsavematrix.pdf (ppmraw/72dpi/noband) against baseline ... DIFFER
Checking pdfwrite of textsavematrix.pdf (ppmraw/300dpi/noband) against baseline ... DIFFER
Checking pdfwrite of textsavematrix.pdf (pkmraw/300dpi/noband) against baseline ... DIFFER
Checking pdfwrite of xes2ps-problem.pdf (ppmraw/72dpi/noband) against baseline ... DIFFER
Checking pdfwrite of xes2ps-problem.pdf (ppmraw/300dpi/noband) against baseline ... DIFFER
Checking pdfwrite of xes2ps-problem.pdf (pkmraw/300dpi/noband) against baseline ... DIFFER
Checking pdfwrite of xgfddg.pdf (ppmraw/72dpi/noband) against baseline ... DIFFER
Checking pdfwrite of xgfddg.pdf (ppmraw/300dpi/noband) against baseline ... DIFFER
Checking pdfwrite of xgfddg.pdf (pkmraw/300dpi/noband) against baseline ... DIFFER
Checking pdfwrite of CAT_LOGO.ps (ppmraw/72dpi/noband) against baseline ... ERROR
Checking pdfwrite of CAT_LOGO.ps (ppmraw/300dpi/noband) against baseline ... ERROR
Checking pdfwrite of CAT_LOGO.ps (pkmraw/300dpi/noband) against baseline ... ERROR

======================================================================
ERROR: Checking pdfwrite of bla.ps (ppmraw/72dpi/noband) against baseline
----------------------------------------------------------------------
Traceback (most recent call last):
  File "/home/regression/regression/gscheck_pdfwrite.py", line 79, in runTest
    self.assertEqual(sum, gssum.get_sum(file2), "md5sum did not match baseline (" + file2 + ") for file: " + self.file)
  File "/home/regression/regression/gssum.py", line 43, in get_sum
    sum = db[file]
KeyError: bla.ps.pdf.ppmraw.72.0
======================================================================
ERROR: Checking pdfwrite of bla.ps (ppmraw/300dpi/noband) against baseline
----------------------------------------------------------------------
Traceback (most recent call last):
  File "/home/regression/regression/gscheck_pdfwrite.py", line 79, in runTest
    self.assertEqual(sum, gssum.get_sum(file2), "md5sum did not match baseline (" + file2 + ") for file: " + self.file)
  File "/home/regression/regression/gssum.py", line 43, in get_sum
    sum = db[file]
KeyError: bla.ps.pdf.ppmraw.300.0
======================================================================
ERROR: Checking pdfwrite of bla.ps (pkmraw/300dpi/noband) against baseline
----------------------------------------------------------------------
Traceback (most recent call last):
  File "/home/regression/regression/gscheck_pdfwrite.py", line 79, in runTest
    self.assertEqual(sum, gssum.get_sum(file2), "md5sum did not match baseline (" + file2 + ") for file: " + self.file)
  File "/home/regression/regression/gssum.py", line 43, in get_sum
    sum = db[file]
KeyError: bla.ps.pdf.pkmraw.300.0
======================================================================
ERROR: Checking pdfwrite of CAT_LOGO.ps (ppmraw/72dpi/noband) against baseline
----------------------------------------------------------------------
Traceback (most recent call last):
  File "/home/regression/regression/gscheck_pdfwrite.py", line 79, in runTest
    self.assertEqual(sum, gssum.get_sum(file2), "md5sum did not match baseline (" + file2 + ") for file: " + self.file)
  File "/home/regression/regression/gssum.py", line 43, in get_sum
    sum = db[file]
KeyError: CAT_LOGO.ps.pdf.ppmraw.72.0
======================================================================
ERROR: Checking pdfwrite of CAT_LOGO.ps (ppmraw/300dpi/noband) against baseline
----------------------------------------------------------------------
Traceback (most recent call last):
  File "/home/regression/regression/gscheck_pdfwrite.py", line 79, in runTest
    self.assertEqual(sum, gssum.get_sum(file2), "md5sum did not match baseline (" + file2 + ") for file: " + self.file)
  File "/home/regression/regression/gssum.py", line 43, in get_sum
    sum = db[file]
KeyError: CAT_LOGO.ps.pdf.ppmraw.300.0
======================================================================
ERROR: Checking pdfwrite of CAT_LOGO.ps (pkmraw/300dpi/noband) against baseline
----------------------------------------------------------------------
Traceback (most recent call last):
  File "/home/regression/regression/gscheck_pdfwrite.py", line 79, in runTest
    self.assertEqual(sum, gssum.get_sum(file2), "md5sum did not match baseline (" + file2 + ") for file: " + self.file)
  File "/home/regression/regression/gssum.py", line 43, in get_sum
    sum = db[file]
KeyError: CAT_LOGO.ps.pdf.pkmraw.300.0
======================================================================
FAIL: Checking BEST8-99-Path.fh7.pdf (pkmraw/72dpi/noband) against baseline
----------------------------------------------------------------------
md5sum did not match baseline (BEST8-99-Path.fh7.pdf.pkmraw.72.0) for file: /home/regression/comparefiles/BEST8-99-Path.fh7.pdf
======================================================================
FAIL: Checking BEST8-99-Path.fh7.pdf (pkmraw/72dpi/banded) against baseline
----------------------------------------------------------------------
md5sum did not match baseline (BEST8-99-Path.fh7.pdf.pkmraw.72.1) for file: /home/regression/comparefiles/BEST8-99-Path.fh7.pdf
======================================================================
FAIL: Checking BEST8-99-Path.fh7.pdf (pkmraw/300dpi/noband) against baseline
----------------------------------------------------------------------
md5sum did not match baseline (BEST8-99-Path.fh7.pdf.pkmraw.300.0) for file: /home/regression/comparefiles/BEST8-99-Path.fh7.pdf
======================================================================
FAIL: Checking BEST8-99-Path.fh7.pdf (pkmraw/300dpi/banded) against baseline
----------------------------------------------------------------------
md5sum did not match baseline (BEST8-99-Path.fh7.pdf.pkmraw.300.1) for file: /home/regression/comparefiles/BEST8-99-Path.fh7.pdf
======================================================================
FAIL: Checking Original.pdf (pkmraw/72dpi/noband) against baseline
----------------------------------------------------------------------
md5sum did not match baseline (Original.pdf.pkmraw.72.0) for file: /home/regression/comparefiles/Original.pdf
======================================================================
FAIL: Checking Original.pdf (pkmraw/72dpi/banded) against baseline
----------------------------------------------------------------------
md5sum did not match baseline (Original.pdf.pkmraw.72.1) for file: /home/regression/comparefiles/Original.pdf
======================================================================
FAIL: Checking Original.pdf (pkmraw/300dpi/noband) against baseline
----------------------------------------------------------------------
md5sum did not match baseline (Original.pdf.pkmraw.300.0) for file: /home/regression/comparefiles/Original.pdf
======================================================================
FAIL: Checking Original.pdf (pkmraw/300dpi/banded) against baseline
----------------------------------------------------------------------
md5sum did not match baseline (Original.pdf.pkmraw.300.1) for file: /home/regression/comparefiles/Original.pdf
======================================================================
FAIL: Checking pdfwrite of 000040cf.000_60.pdf (ppmraw/72dpi/noband) against baseline
----------------------------------------------------------------------
md5sum did not match baseline (000040cf.000_60.pdf.pdf.ppmraw.72.0) for file: /home/regression/comparefiles/000040cf.000_60.pdf
======================================================================
FAIL: Checking pdfwrite of 000040cf.000_60.pdf (ppmraw/300dpi/noband) against baseline
----------------------------------------------------------------------
md5sum did not match baseline (000040cf.000_60.pdf.pdf.ppmraw.300.0) for file: /home/regression/comparefiles/000040cf.000_60.pdf
======================================================================
FAIL: Checking pdfwrite of 000040cf.000_60.pdf (pkmraw/300dpi/noband) against baseline
----------------------------------------------------------------------
md5sum did not match baseline (000040cf.000_60.pdf.pdf.pkmraw.300.0) for file: /home/regression/comparefiles/000040cf.000_60.pdf
======================================================================
FAIL: Checking pdfwrite of 01_001.pdf (ppmraw/300dpi/noband) against baseline
----------------------------------------------------------------------
md5sum did not match baseline (01_001.pdf.pdf.ppmraw.300.0) for file: /home/regression/comparefiles/01_001.pdf
======================================================================
FAIL: Checking pdfwrite of 01_001.pdf (pkmraw/300dpi/noband) against baseline
----------------------------------------------------------------------
md5sum did not match baseline (01_001.pdf.pdf.pkmraw.300.0) for file: /home/regression/comparefiles/01_001.pdf
======================================================================
FAIL: Checking pdfwrite of 1_pct_50_bang.pdf (ppmraw/72dpi/noband) against baseline
----------------------------------------------------------------------
md5sum did not match baseline (1_pct_50_bang.pdf.pdf.ppmraw.72.0) for file: /home/regression/comparefiles/1_pct_50_bang.pdf
======================================================================
FAIL: Checking pdfwrite of 1_pct_50_bang.pdf (ppmraw/300dpi/noband) against baseline
----------------------------------------------------------------------
md5sum did not match baseline (1_pct_50_bang.pdf.pdf.ppmraw.300.0) for file: /home/regression/comparefiles/1_pct_50_bang.pdf
======================================================================
FAIL: Checking pdfwrite of 1_pct_50_bang.pdf (pkmraw/300dpi/noband) against baseline
----------------------------------------------------------------------
md5sum did not match baseline (1_pct_50_bang.pdf.pdf.pkmraw.300.0) for file: /home/regression/comparefiles/1_pct_50_bang.pdf
======================================================================
FAIL: Checking pdfwrite of 298-05.ps (ppmraw/300dpi/noband) against baseline
----------------------------------------------------------------------
md5sum did not match baseline (298-05.ps.pdf.ppmraw.300.0) for file: /home/regression/comparefiles/298-05.ps
======================================================================
FAIL: Checking pdfwrite of 298-05.ps (pkmraw/300dpi/noband) against baseline
----------------------------------------------------------------------
md5sum did not match baseline (298-05.ps.pdf.pkmraw.300.0) for file: /home/regression/comparefiles/298-05.ps
======================================================================
FAIL: Checking pdfwrite of 321-05.ps (ppmraw/300dpi/noband) against baseline
----------------------------------------------------------------------
md5sum did not match baseline (321-05.ps.pdf.ppmraw.300.0) for file: /home/regression/comparefiles/321-05.ps
======================================================================
FAIL: Checking pdfwrite of 321-05.ps (pkmraw/300dpi/noband) against baseline
----------------------------------------------------------------------
md5sum did not match baseline (321-05.ps.pdf.pkmraw.300.0) for file: /home/regression/comparefiles/321-05.ps
======================================================================
FAIL: Checking pdfwrite of 446-01.ps (ppmraw/72dpi/noband) against baseline
----------------------------------------------------------------------
md5sum did not match baseline (446-01.ps.pdf.ppmraw.72.0) for file: /home/regression/comparefiles/446-01.ps
======================================================================
FAIL: Checking pdfwrite of 446-01.ps (ppmraw/300dpi/noband) against baseline
----------------------------------------------------------------------
md5sum did not match baseline (446-01.ps.pdf.ppmraw.300.0) for file: /home/regression/comparefiles/446-01.ps
======================================================================
FAIL: Checking pdfwrite of 446-01.ps (pkmraw/300dpi/noband) against baseline
----------------------------------------------------------------------
md5sum did not match baseline (446-01.ps.pdf.pkmraw.300.0) for file: /home/regression/comparefiles/446-01.ps
======================================================================
FAIL: Checking pdfwrite of 477-04.ps (ppmraw/72dpi/noband) against baseline
----------------------------------------------------------------------
md5sum did not match baseline (477-04.ps.pdf.ppmraw.72.0) for file: /home/regression/comparefiles/477-04.ps
======================================================================
FAIL: Checking pdfwrite of 477-04.ps (ppmraw/300dpi/noband) against baseline
----------------------------------------------------------------------
md5sum did not match baseline (477-04.ps.pdf.ppmraw.300.0) for file: /home/regression/comparefiles/477-04.ps
======================================================================
FAIL: Checking pdfwrite of 477-04.ps (pkmraw/300dpi/noband) against baseline
----------------------------------------------------------------------
md5sum did not match baseline (477-04.ps.pdf.pkmraw.300.0) for file: /home/regression/comparefiles/477-04.ps
======================================================================
FAIL: Checking pdfwrite of 541.pdf (ppmraw/72dpi/noband) against baseline
----------------------------------------------------------------------
md5sum did not match baseline (541.pdf.pdf.ppmraw.72.0) for file: /home/regression/comparefiles/541.pdf
======================================================================
FAIL: Checking pdfwrite of 541.pdf (ppmraw/300dpi/noband) against baseline
----------------------------------------------------------------------
md5sum did not match baseline (541.pdf.pdf.ppmraw.300.0) for file: /home/regression/comparefiles/541.pdf
======================================================================
FAIL: Checking pdfwrite of 541.pdf (pkmraw/300dpi/noband) against baseline
----------------------------------------------------------------------
md5sum did not match baseline (541.pdf.pdf.pkmraw.300.0) for file: /home/regression/comparefiles/541.pdf
======================================================================
FAIL: Checking pdfwrite of 541_623.pdf (ppmraw/72dpi/noband) against baseline
----------------------------------------------------------------------
md5sum did not match baseline (541_623.pdf.pdf.ppmraw.72.0) for file: /home/regression/comparefiles/541_623.pdf
======================================================================
FAIL: Checking pdfwrite of 541_623.pdf (ppmraw/300dpi/noband) against baseline
----------------------------------------------------------------------
md5sum did not match baseline (541_623.pdf.pdf.ppmraw.300.0) for file: /home/regression/comparefiles/541_623.pdf
======================================================================
FAIL: Checking pdfwrite of 541_623.pdf (pkmraw/300dpi/noband) against baseline
----------------------------------------------------------------------
md5sum did not match baseline (541_623.pdf.pdf.pkmraw.300.0) for file: /home/regression/comparefiles/541_623.pdf
======================================================================
FAIL: Checking pdfwrite of 86554321.pdf (ppmraw/72dpi/noband) against baseline
----------------------------------------------------------------------
md5sum did not match baseline (86554321.pdf.pdf.ppmraw.72.0) for file: /home/regression/comparefiles/86554321.pdf
======================================================================
FAIL: Checking pdfwrite of 86554321.pdf (ppmraw/300dpi/noband) against baseline
----------------------------------------------------------------------
md5sum did not match baseline (86554321.pdf.pdf.ppmraw.300.0) for file: /home/regression/comparefiles/86554321.pdf
======================================================================
FAIL: Checking pdfwrite of 86554321.pdf (pkmraw/300dpi/noband) against baseline
----------------------------------------------------------------------
md5sum did not match baseline (86554321.pdf.pdf.pkmraw.300.0) for file: /home/regression/comparefiles/86554321.pdf
======================================================================
FAIL: Checking pdfwrite of ADOBE1-4.pdf (ppmraw/72dpi/noband) against baseline
----------------------------------------------------------------------
md5sum did not match baseline (ADOBE1-4.pdf.pdf.ppmraw.72.0) for file: /home/regression/comparefiles/ADOBE1-4.pdf
======================================================================
FAIL: Checking pdfwrite of ADOBE1-4.pdf (ppmraw/300dpi/noband) against baseline
----------------------------------------------------------------------
md5sum did not match baseline (ADOBE1-4.pdf.pdf.ppmraw.300.0) for file: /home/regression/comparefiles/ADOBE1-4.pdf
======================================================================
FAIL: Checking pdfwrite of ADOBE1-4.pdf (pkmraw/300dpi/noband) against baseline
----------------------------------------------------------------------
md5sum did not match baseline (ADOBE1-4.pdf.pdf.pkmraw.300.0) for file: /home/regression/comparefiles/ADOBE1-4.pdf
======================================================================
FAIL: Checking pdfwrite of AdobeLic.pdf (ppmraw/72dpi/noband) against baseline
----------------------------------------------------------------------
md5sum did not match baseline (AdobeLic.pdf.pdf.ppmraw.72.0) for file: /home/regression/comparefiles/AdobeLic.pdf
======================================================================
FAIL: Checking pdfwrite of AdobeLic.pdf (ppmraw/300dpi/noband) against baseline
----------------------------------------------------------------------
md5sum did not match baseline (AdobeLic.pdf.pdf.ppmraw.300.0) for file: /home/regression/comparefiles/AdobeLic.pdf
======================================================================
FAIL: Checking pdfwrite of AdobeLic.pdf (pkmraw/300dpi/noband) against baseline
----------------------------------------------------------------------
md5sum did not match baseline (AdobeLic.pdf.pdf.pkmraw.300.0) for file: /home/regression/comparefiles/AdobeLic.pdf
======================================================================
FAIL: Checking pdfwrite of Dave_Barry.pdf (ppmraw/72dpi/noband) against baseline
----------------------------------------------------------------------
md5sum did not match baseline (Dave_Barry.pdf.pdf.ppmraw.72.0) for file: /home/regression/comparefiles/Dave_Barry.pdf
======================================================================
FAIL: Checking pdfwrite of Dave_Barry.pdf (ppmraw/300dpi/noband) against baseline
----------------------------------------------------------------------
md5sum did not match baseline (Dave_Barry.pdf.pdf.ppmraw.300.0) for file: /home/regression/comparefiles/Dave_Barry.pdf
======================================================================
FAIL: Checking pdfwrite of Dave_Barry.pdf (pkmraw/300dpi/noband) against baseline
----------------------------------------------------------------------
md5sum did not match baseline (Dave_Barry.pdf.pdf.pkmraw.300.0) for file: /home/regression/comparefiles/Dave_Barry.pdf
======================================================================
FAIL: Checking pdfwrite of DisplayedGood.pdf (ppmraw/72dpi/noband) against baseline
----------------------------------------------------------------------
md5sum did not match baseline (DisplayedGood.pdf.pdf.ppmraw.72.0) for file: /home/regression/comparefiles/DisplayedGood.pdf
======================================================================
FAIL: Checking pdfwrite of DisplayedGood.pdf (ppmraw/300dpi/noband) against baseline
----------------------------------------------------------------------
md5sum did not match baseline (DisplayedGood.pdf.pdf.ppmraw.300.0) for file: /home/regression/comparefiles/DisplayedGood.pdf
======================================================================
FAIL: Checking pdfwrite of DisplayedGood.pdf (pkmraw/300dpi/noband) against baseline
----------------------------------------------------------------------
md5sum did not match baseline (DisplayedGood.pdf.pdf.pkmraw.300.0) for file: /home/regression/comparefiles/DisplayedGood.pdf
======================================================================
FAIL: Checking pdfwrite of DisplayedWrong.pdf (ppmraw/72dpi/noband) against baseline
----------------------------------------------------------------------
md5sum did not match baseline (DisplayedWrong.pdf.pdf.ppmraw.72.0) for file: /home/regression/comparefiles/DisplayedWrong.pdf
======================================================================
FAIL: Checking pdfwrite of DisplayedWrong.pdf (ppmraw/300dpi/noband) against baseline
----------------------------------------------------------------------
md5sum did not match baseline (DisplayedWrong.pdf.pdf.ppmraw.300.0) for file: /home/regression/comparefiles/DisplayedWrong.pdf
======================================================================
FAIL: Checking pdfwrite of DisplayedWrong.pdf (pkmraw/300dpi/noband) against baseline
----------------------------------------------------------------------
md5sum did not match baseline (DisplayedWrong.pdf.pdf.pkmraw.300.0) for file: /home/regression/comparefiles/DisplayedWrong.pdf
======================================================================
FAIL: Checking pdfwrite of Fixed_Original.pdf (ppmraw/300dpi/noband) against baseline
----------------------------------------------------------------------
md5sum did not match baseline (Fixed_Original.pdf.pdf.ppmraw.300.0) for file: /home/regression/comparefiles/Fixed_Original.pdf
======================================================================
FAIL: Checking pdfwrite of Popafinalrep.pdf (ppmraw/72dpi/noband) against baseline
----------------------------------------------------------------------
md5sum did not match baseline (Popafinalrep.pdf.pdf.ppmraw.72.0) for file: /home/regression/comparefiles/Popafinalrep.pdf
======================================================================
FAIL: Checking pdfwrite of Popafinalrep.pdf (ppmraw/300dpi/noband) against baseline
----------------------------------------------------------------------
md5sum did not match baseline (Popafinalrep.pdf.pdf.ppmraw.300.0) for file: /home/regression/comparefiles/Popafinalrep.pdf
======================================================================
FAIL: Checking pdfwrite of Popafinalrep.pdf (pkmraw/300dpi/noband) against baseline
----------------------------------------------------------------------
md5sum did not match baseline (Popafinalrep.pdf.pdf.pkmraw.300.0) for file: /home/regression/comparefiles/Popafinalrep.pdf
======================================================================
FAIL: Checking pdfwrite of QA_Inv.pdf (ppmraw/72dpi/noband) against baseline
----------------------------------------------------------------------
md5sum did not match baseline (QA_Inv.pdf.pdf.ppmraw.72.0) for file: /home/regression/comparefiles/QA_Inv.pdf
======================================================================
FAIL: Checking pdfwrite of QA_Inv.pdf (ppmraw/300dpi/noband) against baseline
----------------------------------------------------------------------
md5sum did not match baseline (QA_Inv.pdf.pdf.ppmraw.300.0) for file: /home/regression/comparefiles/QA_Inv.pdf
======================================================================
FAIL: Checking pdfwrite of QA_Inv.pdf (pkmraw/300dpi/noband) against baseline
----------------------------------------------------------------------
md5sum did not match baseline (QA_Inv.pdf.pdf.pkmraw.300.0) for file: /home/regression/comparefiles/QA_Inv.pdf
======================================================================
FAIL: Checking pdfwrite of RealCities.pdf (ppmraw/72dpi/noband) against baseline
----------------------------------------------------------------------
md5sum did not match baseline (RealCities.pdf.pdf.ppmraw.72.0) for file: /home/regression/comparefiles/RealCities.pdf
======================================================================
FAIL: Checking pdfwrite of RealCities.pdf (ppmraw/300dpi/noband) against baseline
----------------------------------------------------------------------
md5sum did not match baseline (RealCities.pdf.pdf.ppmraw.300.0) for file: /home/regression/comparefiles/RealCities.pdf
======================================================================
FAIL: Checking pdfwrite of RealCities.pdf (pkmraw/300dpi/noband) against baseline
----------------------------------------------------------------------
md5sum did not match baseline (RealCities.pdf.pdf.pkmraw.300.0) for file: /home/regression/comparefiles/RealCities.pdf
======================================================================
FAIL: Checking pdfwrite of Vu989qfj.pdf (ppmraw/72dpi/noband) against baseline
----------------------------------------------------------------------
md5sum did not match baseline (Vu989qfj.pdf.pdf.ppmraw.72.0) for file: /home/regression/comparefiles/Vu989qfj.pdf
======================================================================
FAIL: Checking pdfwrite of Vu989qfj.pdf (ppmraw/300dpi/noband) against baseline
----------------------------------------------------------------------
md5sum did not match baseline (Vu989qfj.pdf.pdf.ppmraw.300.0) for file: /home/regression/comparefiles/Vu989qfj.pdf
======================================================================
FAIL: Checking pdfwrite of Vu989qfj.pdf (pkmraw/300dpi/noband) against baseline
----------------------------------------------------------------------
md5sum did not match baseline (Vu989qfj.pdf.pdf.pkmraw.300.0) for file: /home/regression/comparefiles/Vu989qfj.pdf
======================================================================
FAIL: Checking pdfwrite of adesso2.pdf (ppmraw/72dpi/noband) against baseline
----------------------------------------------------------------------
md5sum did not match baseline (adesso2.pdf.pdf.ppmraw.72.0) for file: /home/regression/comparefiles/adesso2.pdf
======================================================================
FAIL: Checking pdfwrite of adesso2.pdf (ppmraw/300dpi/noband) against baseline
----------------------------------------------------------------------
md5sum did not match baseline (adesso2.pdf.pdf.ppmraw.300.0) for file: /home/regression/comparefiles/adesso2.pdf
======================================================================
FAIL: Checking pdfwrite of adesso2.pdf (pkmraw/300dpi/noband) against baseline
----------------------------------------------------------------------
md5sum did not match baseline (adesso2.pdf.pdf.pkmraw.300.0) for file: /home/regression/comparefiles/adesso2.pdf
======================================================================
FAIL: Checking pdfwrite of adesso5.pdf (ppmraw/72dpi/noband) against baseline
----------------------------------------------------------------------
md5sum did not match baseline (adesso5.pdf.pdf.ppmraw.72.0) for file: /home/regression/comparefiles/adesso5.pdf
======================================================================
FAIL: Checking pdfwrite of adesso5.pdf (ppmraw/300dpi/noband) against baseline
----------------------------------------------------------------------
md5sum did not match baseline (adesso5.pdf.pdf.ppmraw.300.0) for file: /home/regression/comparefiles/adesso5.pdf
======================================================================
FAIL: Checking pdfwrite of adesso5.pdf (pkmraw/300dpi/noband) against baseline
----------------------------------------------------------------------
md5sum did not match baseline (adesso5.pdf.pdf.pkmraw.300.0) for file: /home/regression/comparefiles/adesso5.pdf
======================================================================
FAIL: Checking pdfwrite of adesso7.pdf (ppmraw/72dpi/noband) against baseline
----------------------------------------------------------------------
md5sum did not match baseline (adesso7.pdf.pdf.ppmraw.72.0) for file: /home/regression/comparefiles/adesso7.pdf
======================================================================
FAIL: Checking pdfwrite of adesso7.pdf (ppmraw/300dpi/noband) against baseline
----------------------------------------------------------------------
md5sum did not match baseline (adesso7.pdf.pdf.ppmraw.300.0) for file: /home/regression/comparefiles/adesso7.pdf
======================================================================
FAIL: Checking pdfwrite of adesso7.pdf (pkmraw/300dpi/noband) against baseline
----------------------------------------------------------------------
md5sum did not match baseline (adesso7.pdf.pdf.pkmraw.300.0) for file: /home/regression/comparefiles/adesso7.pdf
======================================================================
FAIL: Checking pdfwrite of adesso8.pdf (ppmraw/72dpi/noband) against baseline
----------------------------------------------------------------------
md5sum did not match baseline (adesso8.pdf.pdf.ppmraw.72.0) for file: /home/regression/comparefiles/adesso8.pdf
======================================================================
FAIL: Checking pdfwrite of adesso8.pdf (ppmraw/300dpi/noband) against baseline
----------------------------------------------------------------------
md5sum did not match baseline (adesso8.pdf.pdf.ppmraw.300.0) for file: /home/regression/comparefiles/adesso8.pdf
======================================================================
FAIL: Checking pdfwrite of adesso8.pdf (pkmraw/300dpi/noband) against baseline
----------------------------------------------------------------------
md5sum did not match baseline (adesso8.pdf.pdf.pkmraw.300.0) for file: /home/regression/comparefiles/adesso8.pdf
======================================================================
FAIL: Checking pdfwrite of bc_02a01_cal.pdf (ppmraw/300dpi/noband) against baseline
----------------------------------------------------------------------
md5sum did not match baseline (bc_02a01_cal.pdf.pdf.ppmraw.300.0) for file: /home/regression/comparefiles/bc_02a01_cal.pdf
======================================================================
FAIL: Checking pdfwrite of bc_02a01_cal.pdf (pkmraw/300dpi/noband) against baseline
----------------------------------------------------------------------
md5sum did not match baseline (bc_02a01_cal.pdf.pdf.pkmraw.300.0) for file: /home/regression/comparefiles/bc_02a01_cal.pdf
======================================================================
FAIL: Checking pdfwrite of besttest.pdf (ppmraw/72dpi/noband) against baseline
----------------------------------------------------------------------
md5sum did not match baseline (besttest.pdf.pdf.ppmraw.72.0) for file: /home/regression/comparefiles/besttest.pdf
======================================================================
FAIL: Checking pdfwrite of besttest.pdf (ppmraw/300dpi/noband) against baseline
----------------------------------------------------------------------
md5sum did not match baseline (besttest.pdf.pdf.ppmraw.300.0) for file: /home/regression/comparefiles/besttest.pdf
======================================================================
FAIL: Checking pdfwrite of besttest.pdf (pkmraw/300dpi/noband) against baseline
----------------------------------------------------------------------
md5sum did not match baseline (besttest.pdf.pdf.pkmraw.300.0) for file: /home/regression/comparefiles/besttest.pdf
======================================================================
FAIL: Checking pdfwrite of ca.pdf (ppmraw/72dpi/noband) against baseline
----------------------------------------------------------------------
md5sum did not match baseline (ca.pdf.pdf.ppmraw.72.0) for file: /home/regression/comparefiles/ca.pdf
======================================================================
FAIL: Checking pdfwrite of ca.pdf (ppmraw/300dpi/noband) against baseline
----------------------------------------------------------------------
md5sum did not match baseline (ca.pdf.pdf.ppmraw.300.0) for file: /home/regression/comparefiles/ca.pdf
======================================================================
FAIL: Checking pdfwrite of ca.pdf (pkmraw/300dpi/noband) against baseline
----------------------------------------------------------------------
md5sum did not match baseline (ca.pdf.pdf.pkmraw.300.0) for file: /home/regression/comparefiles/ca.pdf
======================================================================
FAIL: Checking pdfwrite of foo.pdf (ppmraw/300dpi/noband) against baseline
----------------------------------------------------------------------
md5sum did not match baseline (foo.pdf.pdf.ppmraw.300.0) for file: /home/regression/comparefiles/foo.pdf
======================================================================
FAIL: Checking pdfwrite of foo.pdf (pkmraw/300dpi/noband) against baseline
----------------------------------------------------------------------
md5sum did not match baseline (foo.pdf.pdf.pkmraw.300.0) for file: /home/regression/comparefiles/foo.pdf
======================================================================
FAIL: Checking pdfwrite of gs.anotherfailure.pdf (ppmraw/72dpi/noband) against baseline
----------------------------------------------------------------------
md5sum did not match baseline (gs.anotherfailure.pdf.pdf.ppmraw.72.0) for file: /home/regression/comparefiles/gs.anotherfailure.pdf
======================================================================
FAIL: Checking pdfwrite of gs.anotherfailure.pdf (ppmraw/300dpi/noband) against baseline
----------------------------------------------------------------------
md5sum did not match baseline (gs.anotherfailure.pdf.pdf.ppmraw.300.0) for file: /home/regression/comparefiles/gs.anotherfailure.pdf
======================================================================
FAIL: Checking pdfwrite of gs.anotherfailure.pdf (pkmraw/300dpi/noband) against baseline
----------------------------------------------------------------------
md5sum did not match baseline (gs.anotherfailure.pdf.pdf.pkmraw.300.0) for file: /home/regression/comparefiles/gs.anotherfailure.pdf
======================================================================
FAIL: Checking pdfwrite of gs5.98-dragon.pdf (ppmraw/72dpi/noband) against baseline
----------------------------------------------------------------------
md5sum did not match baseline (gs5.98-dragon.pdf.pdf.ppmraw.72.0) for file: /home/regression/comparefiles/gs5.98-dragon.pdf
======================================================================
FAIL: Checking pdfwrite of gs5.98-dragon.pdf (ppmraw/300dpi/noband) against baseline
----------------------------------------------------------------------
md5sum did not match baseline (gs5.98-dragon.pdf.pdf.ppmraw.300.0) for file: /home/regression/comparefiles/gs5.98-dragon.pdf
======================================================================
FAIL: Checking pdfwrite of gs5.98-dragon.pdf (pkmraw/300dpi/noband) against baseline
----------------------------------------------------------------------
md5sum did not match baseline (gs5.98-dragon.pdf.pdf.pkmraw.300.0) for file: /home/regression/comparefiles/gs5.98-dragon.pdf
======================================================================
FAIL: Checking pdfwrite of js.pdf (ppmraw/300dpi/noband) against baseline
----------------------------------------------------------------------
md5sum did not match baseline (js.pdf.pdf.ppmraw.300.0) for file: /home/regression/comparefiles/js.pdf
======================================================================
FAIL: Checking pdfwrite of js.pdf (pkmraw/300dpi/noband) against baseline
----------------------------------------------------------------------
md5sum did not match baseline (js.pdf.pdf.pkmraw.300.0) for file: /home/regression/comparefiles/js.pdf
======================================================================
FAIL: Checking pdfwrite of kazmir.pdf (ppmraw/72dpi/noband) against baseline
----------------------------------------------------------------------
md5sum did not match baseline (kazmir.pdf.pdf.ppmraw.72.0) for file: /home/regression/comparefiles/kazmir.pdf
======================================================================
FAIL: Checking pdfwrite of kazmir.pdf (ppmraw/300dpi/noband) against baseline
----------------------------------------------------------------------
md5sum did not match baseline (kazmir.pdf.pdf.ppmraw.300.0) for file: /home/regression/comparefiles/kazmir.pdf
======================================================================
FAIL: Checking pdfwrite of kazmir.pdf (pkmraw/300dpi/noband) against baseline
----------------------------------------------------------------------
md5sum did not match baseline (kazmir.pdf.pdf.pkmraw.300.0) for file: /home/regression/comparefiles/kazmir.pdf
======================================================================
FAIL: Checking pdfwrite of knight.pdf (ppmraw/300dpi/noband) against baseline
----------------------------------------------------------------------
md5sum did not match baseline (knight.pdf.pdf.ppmraw.300.0) for file: /home/regression/comparefiles/knight.pdf
======================================================================
FAIL: Checking pdfwrite of knight.pdf (pkmraw/300dpi/noband) against baseline
----------------------------------------------------------------------
md5sum did not match baseline (knight.pdf.pdf.pkmraw.300.0) for file: /home/regression/comparefiles/knight.pdf
======================================================================
FAIL: Checking pdfwrite of messenger.pdf (ppmraw/72dpi/noband) against baseline
----------------------------------------------------------------------
md5sum did not match baseline (messenger.pdf.pdf.ppmraw.72.0) for file: /home/regression/comparefiles/messenger.pdf
======================================================================
FAIL: Checking pdfwrite of messenger.pdf (ppmraw/300dpi/noband) against baseline
----------------------------------------------------------------------
md5sum did not match baseline (messenger.pdf.pdf.ppmraw.300.0) for file: /home/regression/comparefiles/messenger.pdf
======================================================================
FAIL: Checking pdfwrite of messenger.pdf (pkmraw/300dpi/noband) against baseline
----------------------------------------------------------------------
md5sum did not match baseline (messenger.pdf.pdf.pkmraw.300.0) for file: /home/regression/comparefiles/messenger.pdf
======================================================================
FAIL: Checking pdfwrite of messenger16.pdf (ppmraw/72dpi/noband) against baseline
----------------------------------------------------------------------
md5sum did not match baseline (messenger16.pdf.pdf.ppmraw.72.0) for file: /home/regression/comparefiles/messenger16.pdf
======================================================================
FAIL: Checking pdfwrite of messenger16.pdf (ppmraw/300dpi/noband) against baseline
----------------------------------------------------------------------
md5sum did not match baseline (messenger16.pdf.pdf.ppmraw.300.0) for file: /home/regression/comparefiles/messenger16.pdf
======================================================================
FAIL: Checking pdfwrite of messenger16.pdf (pkmraw/300dpi/noband) against baseline
----------------------------------------------------------------------
md5sum did not match baseline (messenger16.pdf.pdf.pkmraw.300.0) for file: /home/regression/comparefiles/messenger16.pdf
======================================================================
FAIL: Checking pdfwrite of mspro.pdf (ppmraw/72dpi/noband) against baseline
----------------------------------------------------------------------
md5sum did not match baseline (mspro.pdf.pdf.ppmraw.72.0) for file: /home/regression/comparefiles/mspro.pdf
======================================================================
FAIL: Checking pdfwrite of mspro.pdf (ppmraw/300dpi/noband) against baseline
----------------------------------------------------------------------
md5sum did not match baseline (mspro.pdf.pdf.ppmraw.300.0) for file: /home/regression/comparefiles/mspro.pdf
======================================================================
FAIL: Checking pdfwrite of mspro.pdf (pkmraw/300dpi/noband) against baseline
----------------------------------------------------------------------
md5sum did not match baseline (mspro.pdf.pdf.pkmraw.300.0) for file: /home/regression/comparefiles/mspro.pdf
======================================================================
FAIL: Checking pdfwrite of new_rect.pdf (ppmraw/72dpi/noband) against baseline
----------------------------------------------------------------------
md5sum did not match baseline (new_rect.pdf.pdf.ppmraw.72.0) for file: /home/regression/comparefiles/new_rect.pdf
======================================================================
FAIL: Checking pdfwrite of new_rect.pdf (ppmraw/300dpi/noband) against baseline
----------------------------------------------------------------------
md5sum did not match baseline (new_rect.pdf.pdf.ppmraw.300.0) for file: /home/regression/comparefiles/new_rect.pdf
======================================================================
FAIL: Checking pdfwrite of new_rect.pdf (pkmraw/300dpi/noband) against baseline
----------------------------------------------------------------------
md5sum did not match baseline (new_rect.pdf.pdf.pkmraw.300.0) for file: /home/regression/comparefiles/new_rect.pdf
======================================================================
FAIL: Checking pdfwrite of new_rect_nr.pdf (ppmraw/72dpi/noband) against baseline
----------------------------------------------------------------------
md5sum did not match baseline (new_rect_nr.pdf.pdf.ppmraw.72.0) for file: /home/regression/comparefiles/new_rect_nr.pdf
======================================================================
FAIL: Checking pdfwrite of new_rect_nr.pdf (ppmraw/300dpi/noband) against baseline
----------------------------------------------------------------------
md5sum did not match baseline (new_rect_nr.pdf.pdf.ppmraw.300.0) for file: /home/regression/comparefiles/new_rect_nr.pdf
======================================================================
FAIL: Checking pdfwrite of new_rect_nr.pdf (pkmraw/300dpi/noband) against baseline
----------------------------------------------------------------------
md5sum did not match baseline (new_rect_nr.pdf.pdf.pkmraw.300.0) for file: /home/regression/comparefiles/new_rect_nr.pdf
======================================================================
FAIL: Checking pdfwrite of p2b-100.pdf (ppmraw/72dpi/noband) against baseline
----------------------------------------------------------------------
md5sum did not match baseline (p2b-100.pdf.pdf.ppmraw.72.0) for file: /home/regression/comparefiles/p2b-100.pdf
======================================================================
FAIL: Checking pdfwrite of p2b-100.pdf (ppmraw/300dpi/noband) against baseline
----------------------------------------------------------------------
md5sum did not match baseline (p2b-100.pdf.pdf.ppmraw.300.0) for file: /home/regression/comparefiles/p2b-100.pdf
======================================================================
FAIL: Checking pdfwrite of p2b-100.pdf (pkmraw/300dpi/noband) against baseline
----------------------------------------------------------------------
md5sum did not match baseline (p2b-100.pdf.pdf.pkmraw.300.0) for file: /home/regression/comparefiles/p2b-100.pdf
======================================================================
FAIL: Checking pdfwrite of pdftops.pdf (ppmraw/72dpi/noband) against baseline
----------------------------------------------------------------------
md5sum did not match baseline (pdftops.pdf.pdf.ppmraw.72.0) for file: /home/regression/comparefiles/pdftops.pdf
======================================================================
FAIL: Checking pdfwrite of pdftops.pdf (ppmraw/300dpi/noband) against baseline
----------------------------------------------------------------------
md5sum did not match baseline (pdftops.pdf.pdf.ppmraw.300.0) for file: /home/regression/comparefiles/pdftops.pdf
======================================================================
FAIL: Checking pdfwrite of pdftops.pdf (pkmraw/300dpi/noband) against baseline
----------------------------------------------------------------------
md5sum did not match baseline (pdftops.pdf.pdf.pkmraw.300.0) for file: /home/regression/comparefiles/pdftops.pdf
======================================================================
FAIL: Checking pdfwrite of spec_gs.pdf (ppmraw/72dpi/noband) against baseline
----------------------------------------------------------------------
md5sum did not match baseline (spec_gs.pdf.pdf.ppmraw.72.0) for file: /home/regression/comparefiles/spec_gs.pdf
======================================================================
FAIL: Checking pdfwrite of spec_gs.pdf (ppmraw/300dpi/noband) against baseline
----------------------------------------------------------------------
md5sum did not match baseline (spec_gs.pdf.pdf.ppmraw.300.0) for file: /home/regression/comparefiles/spec_gs.pdf
======================================================================
FAIL: Checking pdfwrite of spec_gs.pdf (pkmraw/300dpi/noband) against baseline
----------------------------------------------------------------------
md5sum did not match baseline (spec_gs.pdf.pdf.pkmraw.300.0) for file: /home/regression/comparefiles/spec_gs.pdf
======================================================================
FAIL: Checking pdfwrite of spec_gv.pdf (ppmraw/72dpi/noband) against baseline
----------------------------------------------------------------------
md5sum did not match baseline (spec_gv.pdf.pdf.ppmraw.72.0) for file: /home/regression/comparefiles/spec_gv.pdf
======================================================================
FAIL: Checking pdfwrite of spec_gv.pdf (ppmraw/300dpi/noband) against baseline
----------------------------------------------------------------------
md5sum did not match baseline (spec_gv.pdf.pdf.ppmraw.300.0) for file: /home/regression/comparefiles/spec_gv.pdf
======================================================================
FAIL: Checking pdfwrite of spec_gv.pdf (pkmraw/300dpi/noband) against baseline
----------------------------------------------------------------------
md5sum did not match baseline (spec_gv.pdf.pdf.pkmraw.300.0) for file: /home/regression/comparefiles/spec_gv.pdf
======================================================================
FAIL: Checking pdfwrite of test-hyperref.pdf (ppmraw/300dpi/noband) against baseline
----------------------------------------------------------------------
md5sum did not match baseline (test-hyperref.pdf.pdf.ppmraw.300.0) for file: /home/regression/comparefiles/test-hyperref.pdf
======================================================================
FAIL: Checking pdfwrite of test-hyperref.pdf (pkmraw/300dpi/noband) against baseline
----------------------------------------------------------------------
md5sum did not match baseline (test-hyperref.pdf.pdf.pkmraw.300.0) for file: /home/regression/comparefiles/test-hyperref.pdf
======================================================================
FAIL: Checking pdfwrite of test2.pdf (ppmraw/72dpi/noband) against baseline
----------------------------------------------------------------------
md5sum did not match baseline (test2.pdf.pdf.ppmraw.72.0) for file: /home/regression/comparefiles/test2.pdf
======================================================================
FAIL: Checking pdfwrite of test2a.pdf (ppmraw/72dpi/noband) against baseline
----------------------------------------------------------------------
md5sum did not match baseline (test2a.pdf.pdf.ppmraw.72.0) for file: /home/regression/comparefiles/test2a.pdf
======================================================================
FAIL: Checking pdfwrite of test3.pdf (ppmraw/72dpi/noband) against baseline
----------------------------------------------------------------------
md5sum did not match baseline (test3.pdf.pdf.ppmraw.72.0) for file: /home/regression/comparefiles/test3.pdf
======================================================================
FAIL: Checking pdfwrite of test3.pdf (ppmraw/300dpi/noband) against baseline
----------------------------------------------------------------------
md5sum did not match baseline (test3.pdf.pdf.ppmraw.300.0) for file: /home/regression/comparefiles/test3.pdf
======================================================================
FAIL: Checking pdfwrite of test3.pdf (pkmraw/300dpi/noband) against baseline
----------------------------------------------------------------------
md5sum did not match baseline (test3.pdf.pdf.pkmraw.300.0) for file: /home/regression/comparefiles/test3.pdf
======================================================================
FAIL: Checking pdfwrite of textsavematrix.pdf (ppmraw/72dpi/noband) against baseline
----------------------------------------------------------------------
md5sum did not match baseline (textsavematrix.pdf.pdf.ppmraw.72.0) for file: /home/regression/comparefiles/textsavematrix.pdf
======================================================================
FAIL: Checking pdfwrite of textsavematrix.pdf (ppmraw/300dpi/noband) against baseline
----------------------------------------------------------------------
md5sum did not match baseline (textsavematrix.pdf.pdf.ppmraw.300.0) for file: /home/regression/comparefiles/textsavematrix.pdf
======================================================================
FAIL: Checking pdfwrite of textsavematrix.pdf (pkmraw/300dpi/noband) against baseline
----------------------------------------------------------------------
md5sum did not match baseline (textsavematrix.pdf.pdf.pkmraw.300.0) for file: /home/regression/comparefiles/textsavematrix.pdf
======================================================================
FAIL: Checking pdfwrite of xes2ps-problem.pdf (ppmraw/72dpi/noband) against baseline
----------------------------------------------------------------------
md5sum did not match baseline (xes2ps-problem.pdf.pdf.ppmraw.72.0) for file: /home/regression/comparefiles/xes2ps-problem.pdf
======================================================================
FAIL: Checking pdfwrite of xes2ps-problem.pdf (ppmraw/300dpi/noband) against baseline
----------------------------------------------------------------------
md5sum did not match baseline (xes2ps-problem.pdf.pdf.ppmraw.300.0) for file: /home/regression/comparefiles/xes2ps-problem.pdf
======================================================================
FAIL: Checking pdfwrite of xes2ps-problem.pdf (pkmraw/300dpi/noband) against baseline
----------------------------------------------------------------------
md5sum did not match baseline (xes2ps-problem.pdf.pdf.pkmraw.300.0) for file: /home/regression/comparefiles/xes2ps-problem.pdf
======================================================================
FAIL: Checking pdfwrite of xgfddg.pdf (ppmraw/72dpi/noband) against baseline
----------------------------------------------------------------------
md5sum did not match baseline (xgfddg.pdf.pdf.ppmraw.72.0) for file: /home/regression/comparefiles/xgfddg.pdf
======================================================================
FAIL: Checking pdfwrite of xgfddg.pdf (ppmraw/300dpi/noband) against baseline
----------------------------------------------------------------------
md5sum did not match baseline (xgfddg.pdf.pdf.ppmraw.300.0) for file: /home/regression/comparefiles/xgfddg.pdf
======================================================================
FAIL: Checking pdfwrite of xgfddg.pdf (pkmraw/300dpi/noband) against baseline
----------------------------------------------------------------------
md5sum did not match baseline (xgfddg.pdf.pdf.pkmraw.300.0) for file: /home/regression/comparefiles/xgfddg.pdf
----------------------------------------------------------------------
Ran 6913 tests in 8939.116s

FAILED (failures=141, errors=6)