[gs-regression] gs regression report - 2002-10-24

regression@casper.ghostscript.com regression@casper.ghostscript.com
Thu, 24 Oct 2002 05:41:27 -0700


The following regression changes happened since yesterday's report:
Traceback (most recent call last):
  File "/home/regression/regression/testdiff", line 130, in ?
    if end_db[k] != baseline_db[k]:
KeyError: S2_Digitalproof-Forum_circles.pdf.ppmraw.300.0


The complete list of regressions for today:
Checking Fixed_Original.pdf (pgmraw/300dpi/noband) against baseline ... DIFFER
Checking Fixed_Original.pdf (pgmraw/300dpi/banded) against baseline ... DIFFER
Checking Fixed_Original.pdf (ppmraw/300dpi/noband) against baseline ... DIFFER
Checking Fixed_Original.pdf (ppmraw/300dpi/banded) against baseline ... DIFFER
Checking Altona-Testsuite_p2_S_x3.pdf (pbmraw/72dpi/noband) against baseline ... DIFFER
Checking Altona-Testsuite_p2_S_x3.pdf (pbmraw/72dpi/banded) against baseline ... DIFFER
Checking Altona-Testsuite_p2_S_x3.pdf (pbmraw/300dpi/noband) against baseline ... DIFFER
Checking Altona-Testsuite_p2_S_x3.pdf (pbmraw/300dpi/banded) against baseline ... DIFFER
Checking Altona-Testsuite_p2_S_x3.pdf (pgmraw/72dpi/noband) against baseline ... DIFFER
Checking Altona-Testsuite_p2_S_x3.pdf (pgmraw/72dpi/banded) against baseline ... DIFFER
Checking Altona-Testsuite_p2_S_x3.pdf (pgmraw/300dpi/noband) against baseline ... DIFFER
Checking Altona-Testsuite_p2_S_x3.pdf (pgmraw/300dpi/banded) against baseline ... DIFFER
Checking Altona-Testsuite_p2_S_x3.pdf (ppmraw/72dpi/noband) against baseline ... DIFFER
Checking Altona-Testsuite_p2_S_x3.pdf (ppmraw/72dpi/banded) against baseline ... DIFFER
Checking Altona-Testsuite_p2_S_x3.pdf (ppmraw/300dpi/noband) against baseline ... DIFFER
Checking Altona-Testsuite_p2_S_x3.pdf (ppmraw/300dpi/banded) against baseline ... DIFFER
Checking Altona-Testsuite_p2_S_x3.pdf (pkmraw/72dpi/noband) against baseline ... DIFFER
Checking Altona-Testsuite_p2_S_x3.pdf (pkmraw/72dpi/banded) against baseline ... DIFFER
Checking Altona-Testsuite_p2_S_x3.pdf (pkmraw/300dpi/noband) against baseline ... DIFFER
Checking Altona-Testsuite_p2_S_x3.pdf (pkmraw/300dpi/banded) against baseline ... DIFFER
Checking Altona.Page_3.2002-09-27.pdf (pbmraw/72dpi/noband) against baseline ... DIFFER
Checking Altona.Page_3.2002-09-27.pdf (pbmraw/72dpi/banded) against baseline ... DIFFER
Checking Altona.Page_3.2002-09-27.pdf (pbmraw/300dpi/noband) against baseline ... DIFFER
Checking Altona.Page_3.2002-09-27.pdf (pbmraw/300dpi/banded) against baseline ... DIFFER
Checking Altona.Page_3.2002-09-27.pdf (pgmraw/72dpi/noband) against baseline ... DIFFER
Checking Altona.Page_3.2002-09-27.pdf (pgmraw/72dpi/banded) against baseline ... DIFFER
Checking Altona.Page_3.2002-09-27.pdf (pgmraw/300dpi/noband) against baseline ... DIFFER
Checking Altona.Page_3.2002-09-27.pdf (pgmraw/300dpi/banded) against baseline ... DIFFER
Checking Altona.Page_3.2002-09-27.pdf (ppmraw/72dpi/noband) against baseline ... DIFFER
Checking Altona.Page_3.2002-09-27.pdf (ppmraw/72dpi/banded) against baseline ... DIFFER
Checking Altona.Page_3.2002-09-27.pdf (ppmraw/300dpi/noband) against baseline ... DIFFER
Checking Altona.Page_3.2002-09-27.pdf (ppmraw/300dpi/banded) against baseline ... DIFFER
Checking Altona.Page_3.2002-09-27.pdf (pkmraw/72dpi/noband) against baseline ... DIFFER
Checking Altona.Page_3.2002-09-27.pdf (pkmraw/72dpi/banded) against baseline ... DIFFER
Checking Altona.Page_3.2002-09-27.pdf (pkmraw/300dpi/noband) against baseline ... DIFFER
Checking Altona.Page_3.2002-09-27.pdf (pkmraw/300dpi/banded) against baseline ... DIFFER
Checking S2_Digitalproof-Forum_circles.pdf (pbmraw/72dpi/noband) against baseline ... ERROR
Checking S2_Digitalproof-Forum_circles.pdf (pbmraw/72dpi/banded) against baseline ... ERROR
Checking S2_Digitalproof-Forum_circles.pdf (pbmraw/300dpi/noband) against baseline ... ERROR
Checking S2_Digitalproof-Forum_circles.pdf (pbmraw/300dpi/banded) against baseline ... ERROR
Checking S2_Digitalproof-Forum_circles.pdf (pgmraw/72dpi/noband) against baseline ... ERROR
Checking S2_Digitalproof-Forum_circles.pdf (pgmraw/72dpi/banded) against baseline ... ERROR
Checking S2_Digitalproof-Forum_circles.pdf (pgmraw/300dpi/noband) against baseline ... ERROR
Checking S2_Digitalproof-Forum_circles.pdf (pgmraw/300dpi/banded) against baseline ... ERROR
Checking S2_Digitalproof-Forum_circles.pdf (ppmraw/72dpi/noband) against baseline ... ERROR
Checking S2_Digitalproof-Forum_circles.pdf (ppmraw/72dpi/banded) against baseline ... ERROR
Checking S2_Digitalproof-Forum_circles.pdf (ppmraw/300dpi/noband) against baseline ... ERROR
Checking S2_Digitalproof-Forum_circles.pdf (ppmraw/300dpi/banded) against baseline ... ERROR
Checking S2_Digitalproof-Forum_circles.pdf (pkmraw/72dpi/noband) against baseline ... ERROR
Checking S2_Digitalproof-Forum_circles.pdf (pkmraw/72dpi/banded) against baseline ... ERROR
Checking S2_Digitalproof-Forum_circles.pdf (pkmraw/300dpi/noband) against baseline ... ERROR
Checking S2_Digitalproof-Forum_circles.pdf (pkmraw/300dpi/banded) against baseline ... ERROR
Checking S2_Digitalproof-Forum_x3k.pdf (pbmraw/72dpi/noband) against baseline ... DIFFER
Checking S2_Digitalproof-Forum_x3k.pdf (pbmraw/72dpi/banded) against baseline ... DIFFER
Checking S2_Digitalproof-Forum_x3k.pdf (pbmraw/300dpi/noband) against baseline ... DIFFER
Checking S2_Digitalproof-Forum_x3k.pdf (pbmraw/300dpi/banded) against baseline ... DIFFER
Checking S2_Digitalproof-Forum_x3k.pdf (pgmraw/72dpi/noband) against baseline ... DIFFER
Checking S2_Digitalproof-Forum_x3k.pdf (pgmraw/72dpi/banded) against baseline ... DIFFER
Checking S2_Digitalproof-Forum_x3k.pdf (pgmraw/300dpi/noband) against baseline ... DIFFER
Checking S2_Digitalproof-Forum_x3k.pdf (pgmraw/300dpi/banded) against baseline ... DIFFER
Checking S2_Digitalproof-Forum_x3k.pdf (ppmraw/72dpi/noband) against baseline ... DIFFER
Checking S2_Digitalproof-Forum_x3k.pdf (ppmraw/72dpi/banded) against baseline ... DIFFER
Checking S2_Digitalproof-Forum_x3k.pdf (ppmraw/300dpi/noband) against baseline ... DIFFER
Checking S2_Digitalproof-Forum_x3k.pdf (ppmraw/300dpi/banded) against baseline ... DIFFER
Checking S2_Digitalproof-Forum_x3k.pdf (pkmraw/72dpi/noband) against baseline ... DIFFER
Checking S2_Digitalproof-Forum_x3k.pdf (pkmraw/72dpi/banded) against baseline ... DIFFER
Checking S2_Digitalproof-Forum_x3k.pdf (pkmraw/300dpi/noband) against baseline ... DIFFER
Checking S2_Digitalproof-Forum_x3k.pdf (pkmraw/300dpi/banded) against baseline ... DIFFER
Checking Testform.v1.0.2.pdf (pbmraw/72dpi/noband) against baseline ... DIFFER
Checking Testform.v1.0.2.pdf (pbmraw/72dpi/banded) against baseline ... DIFFER
Checking Testform.v1.0.2.pdf (pbmraw/300dpi/noband) against baseline ... DIFFER
Checking Testform.v1.0.2.pdf (pbmraw/300dpi/banded) against baseline ... DIFFER
Checking Testform.v1.0.2.pdf (pgmraw/72dpi/noband) against baseline ... DIFFER
Checking Testform.v1.0.2.pdf (pgmraw/72dpi/banded) against baseline ... DIFFER
Checking Testform.v1.0.2.pdf (pgmraw/300dpi/noband) against baseline ... DIFFER
Checking Testform.v1.0.2.pdf (pgmraw/300dpi/banded) against baseline ... DIFFER
Checking Testform.v1.0.2.pdf (ppmraw/72dpi/noband) against baseline ... DIFFER
Checking Testform.v1.0.2.pdf (ppmraw/72dpi/banded) against baseline ... DIFFER
Checking Testform.v1.0.2.pdf (ppmraw/300dpi/noband) against baseline ... DIFFER
Checking Testform.v1.0.2.pdf (ppmraw/300dpi/banded) against baseline ... DIFFER
Checking Testform.v1.0.2.pdf (pkmraw/72dpi/noband) against baseline ... DIFFER
Checking Testform.v1.0.2.pdf (pkmraw/72dpi/banded) against baseline ... DIFFER
Checking Testform.v1.0.2.pdf (pkmraw/300dpi/noband) against baseline ... DIFFER
Checking Testform.v1.0.2.pdf (pkmraw/300dpi/banded) against baseline ... DIFFER
Checking pdfwrite of 321-05.ps (ppmraw/300dpi/noband) against baseline ... DIFFER
Checking pdfwrite of 321-05.ps (pkmraw/300dpi/noband) against baseline ... DIFFER
Checking pdfwrite of Fixed_Original.pdf (ppmraw/300dpi/noband) against baseline ... DIFFER
Checking pdfwrite of QA_Inv.pdf (ppmraw/72dpi/noband) against baseline ... DIFFER
Checking pdfwrite of QA_Inv.pdf (ppmraw/300dpi/noband) against baseline ... DIFFER
Checking pdfwrite of QA_Inv.pdf (pkmraw/300dpi/noband) against baseline ... DIFFER
Checking pdfwrite of gs.anotherfailure.pdf (ppmraw/72dpi/noband) against baseline ... DIFFER
Checking pdfwrite of gs.anotherfailure.pdf (ppmraw/300dpi/noband) against baseline ... DIFFER
Checking pdfwrite of gs.anotherfailure.pdf (pkmraw/300dpi/noband) against baseline ... DIFFER
Checking pdfwrite of gs5.98-dragon.pdf (ppmraw/72dpi/noband) against baseline ... DIFFER
Checking pdfwrite of gs5.98-dragon.pdf (ppmraw/300dpi/noband) against baseline ... DIFFER
Checking pdfwrite of gs5.98-dragon.pdf (pkmraw/300dpi/noband) against baseline ... DIFFER
Checking pdfwrite of kazmir.pdf (ppmraw/72dpi/noband) against baseline ... DIFFER
Checking pdfwrite of kazmir.pdf (ppmraw/300dpi/noband) against baseline ... DIFFER
Checking pdfwrite of kazmir.pdf (pkmraw/300dpi/noband) against baseline ... DIFFER
Checking pdfwrite of knight.pdf (ppmraw/300dpi/noband) against baseline ... DIFFER
Checking pdfwrite of knight.pdf (pkmraw/300dpi/noband) against baseline ... DIFFER
Checking pdfwrite of test2.pdf (ppmraw/72dpi/noband) against baseline ... DIFFER
Checking pdfwrite of CAT_LOGO.ps (ppmraw/72dpi/noband) against baseline ... DIFFER
Checking pdfwrite of CAT_LOGO.ps (ppmraw/300dpi/noband) against baseline ... DIFFER
Checking pdfwrite of CAT_LOGO.ps (pkmraw/300dpi/noband) against baseline ... DIFFER
Checking pdfwrite of Altona-Testsuite_p2_S_x3.pdf (ppmraw/72dpi/noband) against baseline ... ERROR
Checking pdfwrite of Altona-Testsuite_p2_S_x3.pdf (ppmraw/300dpi/noband) against baseline ... ERROR
Checking pdfwrite of Altona-Testsuite_p2_S_x3.pdf (pkmraw/300dpi/noband) against baseline ... ERROR
Checking pdfwrite of Altona.Page_3.2002-09-27.pdf (ppmraw/72dpi/noband) against baseline ... ERROR
Checking pdfwrite of Altona.Page_3.2002-09-27.pdf (ppmraw/300dpi/noband) against baseline ... ERROR
Checking pdfwrite of Altona.Page_3.2002-09-27.pdf (pkmraw/300dpi/noband) against baseline ... ERROR
Checking pdfwrite of S2_Digitalproof-Forum_circles.pdf (ppmraw/72dpi/noband) against baseline ... ERROR
Checking pdfwrite of S2_Digitalproof-Forum_circles.pdf (ppmraw/300dpi/noband) against baseline ... ERROR
Checking pdfwrite of S2_Digitalproof-Forum_circles.pdf (pkmraw/300dpi/noband) against baseline ... ERROR
Checking pdfwrite of S2_Digitalproof-Forum_x3k.pdf (ppmraw/72dpi/noband) against baseline ... ERROR
Checking pdfwrite of S2_Digitalproof-Forum_x3k.pdf (ppmraw/300dpi/noband) against baseline ... ERROR
Checking pdfwrite of S2_Digitalproof-Forum_x3k.pdf (pkmraw/300dpi/noband) against baseline ... ERROR
Checking pdfwrite of Testform.v1.0.2.pdf (ppmraw/72dpi/noband) against baseline ... ERROR
Checking pdfwrite of Testform.v1.0.2.pdf (ppmraw/300dpi/noband) against baseline ... ERROR
Checking pdfwrite of Testform.v1.0.2.pdf (pkmraw/300dpi/noband) against baseline ... ERROR

======================================================================
ERROR: Checking S2_Digitalproof-Forum_circles.pdf (pbmraw/72dpi/noband) against baseline
----------------------------------------------------------------------
Traceback (most recent call last):
  File "/home/regression/regression/gstestgs.py", line 158, in runTest
    self.assertEqual(sum, gssum.get_sum(file), 'md5sum did not match baseline (' + file + ') for file: ' + self.file)
  File "/home/regression/regression/gssum.py", line 43, in get_sum
    sum = db[file]
KeyError: S2_Digitalproof-Forum_circles.pdf.pbmraw.72.0
======================================================================
ERROR: Checking S2_Digitalproof-Forum_circles.pdf (pbmraw/72dpi/banded) against baseline
----------------------------------------------------------------------
Traceback (most recent call last):
  File "/home/regression/regression/gstestgs.py", line 158, in runTest
    self.assertEqual(sum, gssum.get_sum(file), 'md5sum did not match baseline (' + file + ') for file: ' + self.file)
  File "/home/regression/regression/gssum.py", line 43, in get_sum
    sum = db[file]
KeyError: S2_Digitalproof-Forum_circles.pdf.pbmraw.72.1
======================================================================
ERROR: Checking S2_Digitalproof-Forum_circles.pdf (pbmraw/300dpi/noband) against baseline
----------------------------------------------------------------------
Traceback (most recent call last):
  File "/home/regression/regression/gstestgs.py", line 158, in runTest
    self.assertEqual(sum, gssum.get_sum(file), 'md5sum did not match baseline (' + file + ') for file: ' + self.file)
  File "/home/regression/regression/gssum.py", line 43, in get_sum
    sum = db[file]
KeyError: S2_Digitalproof-Forum_circles.pdf.pbmraw.300.0
======================================================================
ERROR: Checking S2_Digitalproof-Forum_circles.pdf (pbmraw/300dpi/banded) against baseline
----------------------------------------------------------------------
Traceback (most recent call last):
  File "/home/regression/regression/gstestgs.py", line 158, in runTest
    self.assertEqual(sum, gssum.get_sum(file), 'md5sum did not match baseline (' + file + ') for file: ' + self.file)
  File "/home/regression/regression/gssum.py", line 43, in get_sum
    sum = db[file]
KeyError: S2_Digitalproof-Forum_circles.pdf.pbmraw.300.1
======================================================================
ERROR: Checking S2_Digitalproof-Forum_circles.pdf (pgmraw/72dpi/noband) against baseline
----------------------------------------------------------------------
Traceback (most recent call last):
  File "/home/regression/regression/gstestgs.py", line 158, in runTest
    self.assertEqual(sum, gssum.get_sum(file), 'md5sum did not match baseline (' + file + ') for file: ' + self.file)
  File "/home/regression/regression/gssum.py", line 43, in get_sum
    sum = db[file]
KeyError: S2_Digitalproof-Forum_circles.pdf.pgmraw.72.0
======================================================================
ERROR: Checking S2_Digitalproof-Forum_circles.pdf (pgmraw/72dpi/banded) against baseline
----------------------------------------------------------------------
Traceback (most recent call last):
  File "/home/regression/regression/gstestgs.py", line 158, in runTest
    self.assertEqual(sum, gssum.get_sum(file), 'md5sum did not match baseline (' + file + ') for file: ' + self.file)
  File "/home/regression/regression/gssum.py", line 43, in get_sum
    sum = db[file]
KeyError: S2_Digitalproof-Forum_circles.pdf.pgmraw.72.1
======================================================================
ERROR: Checking S2_Digitalproof-Forum_circles.pdf (pgmraw/300dpi/noband) against baseline
----------------------------------------------------------------------
Traceback (most recent call last):
  File "/home/regression/regression/gstestgs.py", line 158, in runTest
    self.assertEqual(sum, gssum.get_sum(file), 'md5sum did not match baseline (' + file + ') for file: ' + self.file)
  File "/home/regression/regression/gssum.py", line 43, in get_sum
    sum = db[file]
KeyError: S2_Digitalproof-Forum_circles.pdf.pgmraw.300.0
======================================================================
ERROR: Checking S2_Digitalproof-Forum_circles.pdf (pgmraw/300dpi/banded) against baseline
----------------------------------------------------------------------
Traceback (most recent call last):
  File "/home/regression/regression/gstestgs.py", line 158, in runTest
    self.assertEqual(sum, gssum.get_sum(file), 'md5sum did not match baseline (' + file + ') for file: ' + self.file)
  File "/home/regression/regression/gssum.py", line 43, in get_sum
    sum = db[file]
KeyError: S2_Digitalproof-Forum_circles.pdf.pgmraw.300.1
======================================================================
ERROR: Checking S2_Digitalproof-Forum_circles.pdf (ppmraw/72dpi/noband) against baseline
----------------------------------------------------------------------
Traceback (most recent call last):
  File "/home/regression/regression/gstestgs.py", line 158, in runTest
    self.assertEqual(sum, gssum.get_sum(file), 'md5sum did not match baseline (' + file + ') for file: ' + self.file)
  File "/home/regression/regression/gssum.py", line 43, in get_sum
    sum = db[file]
KeyError: S2_Digitalproof-Forum_circles.pdf.ppmraw.72.0
======================================================================
ERROR: Checking S2_Digitalproof-Forum_circles.pdf (ppmraw/72dpi/banded) against baseline
----------------------------------------------------------------------
Traceback (most recent call last):
  File "/home/regression/regression/gstestgs.py", line 158, in runTest
    self.assertEqual(sum, gssum.get_sum(file), 'md5sum did not match baseline (' + file + ') for file: ' + self.file)
  File "/home/regression/regression/gssum.py", line 43, in get_sum
    sum = db[file]
KeyError: S2_Digitalproof-Forum_circles.pdf.ppmraw.72.1
======================================================================
ERROR: Checking S2_Digitalproof-Forum_circles.pdf (ppmraw/300dpi/noband) against baseline
----------------------------------------------------------------------
Traceback (most recent call last):
  File "/home/regression/regression/gstestgs.py", line 158, in runTest
    self.assertEqual(sum, gssum.get_sum(file), 'md5sum did not match baseline (' + file + ') for file: ' + self.file)
  File "/home/regression/regression/gssum.py", line 43, in get_sum
    sum = db[file]
KeyError: S2_Digitalproof-Forum_circles.pdf.ppmraw.300.0
======================================================================
ERROR: Checking S2_Digitalproof-Forum_circles.pdf (ppmraw/300dpi/banded) against baseline
----------------------------------------------------------------------
Traceback (most recent call last):
  File "/home/regression/regression/gstestgs.py", line 158, in runTest
    self.assertEqual(sum, gssum.get_sum(file), 'md5sum did not match baseline (' + file + ') for file: ' + self.file)
  File "/home/regression/regression/gssum.py", line 43, in get_sum
    sum = db[file]
KeyError: S2_Digitalproof-Forum_circles.pdf.ppmraw.300.1
======================================================================
ERROR: Checking S2_Digitalproof-Forum_circles.pdf (pkmraw/72dpi/noband) against baseline
----------------------------------------------------------------------
Traceback (most recent call last):
  File "/home/regression/regression/gstestgs.py", line 158, in runTest
    self.assertEqual(sum, gssum.get_sum(file), 'md5sum did not match baseline (' + file + ') for file: ' + self.file)
  File "/home/regression/regression/gssum.py", line 43, in get_sum
    sum = db[file]
KeyError: S2_Digitalproof-Forum_circles.pdf.pkmraw.72.0
======================================================================
ERROR: Checking S2_Digitalproof-Forum_circles.pdf (pkmraw/72dpi/banded) against baseline
----------------------------------------------------------------------
Traceback (most recent call last):
  File "/home/regression/regression/gstestgs.py", line 158, in runTest
    self.assertEqual(sum, gssum.get_sum(file), 'md5sum did not match baseline (' + file + ') for file: ' + self.file)
  File "/home/regression/regression/gssum.py", line 43, in get_sum
    sum = db[file]
KeyError: S2_Digitalproof-Forum_circles.pdf.pkmraw.72.1
======================================================================
ERROR: Checking S2_Digitalproof-Forum_circles.pdf (pkmraw/300dpi/noband) against baseline
----------------------------------------------------------------------
Traceback (most recent call last):
  File "/home/regression/regression/gstestgs.py", line 158, in runTest
    self.assertEqual(sum, gssum.get_sum(file), 'md5sum did not match baseline (' + file + ') for file: ' + self.file)
  File "/home/regression/regression/gssum.py", line 43, in get_sum
    sum = db[file]
KeyError: S2_Digitalproof-Forum_circles.pdf.pkmraw.300.0
======================================================================
ERROR: Checking S2_Digitalproof-Forum_circles.pdf (pkmraw/300dpi/banded) against baseline
----------------------------------------------------------------------
Traceback (most recent call last):
  File "/home/regression/regression/gstestgs.py", line 158, in runTest
    self.assertEqual(sum, gssum.get_sum(file), 'md5sum did not match baseline (' + file + ') for file: ' + self.file)
  File "/home/regression/regression/gssum.py", line 43, in get_sum
    sum = db[file]
KeyError: S2_Digitalproof-Forum_circles.pdf.pkmraw.300.1
======================================================================
ERROR: Checking pdfwrite of Altona-Testsuite_p2_S_x3.pdf (ppmraw/72dpi/noband) against baseline
----------------------------------------------------------------------
Traceback (most recent call last):
  File "/home/regression/regression/gscheck_pdfwrite.py", line 79, in runTest
    self.assertEqual(sum, gssum.get_sum(file2), "md5sum did not match baseline (" + file2 + ") for file: " + self.file)
  File "/home/regression/regression/gssum.py", line 43, in get_sum
    sum = db[file]
KeyError: Altona-Testsuite_p2_S_x3.pdf.pdf.ppmraw.72.0
======================================================================
ERROR: Checking pdfwrite of Altona-Testsuite_p2_S_x3.pdf (ppmraw/300dpi/noband) against baseline
----------------------------------------------------------------------
Traceback (most recent call last):
  File "/home/regression/regression/gscheck_pdfwrite.py", line 79, in runTest
    self.assertEqual(sum, gssum.get_sum(file2), "md5sum did not match baseline (" + file2 + ") for file: " + self.file)
  File "/home/regression/regression/gssum.py", line 43, in get_sum
    sum = db[file]
KeyError: Altona-Testsuite_p2_S_x3.pdf.pdf.ppmraw.300.0
======================================================================
ERROR: Checking pdfwrite of Altona-Testsuite_p2_S_x3.pdf (pkmraw/300dpi/noband) against baseline
----------------------------------------------------------------------
Traceback (most recent call last):
  File "/home/regression/regression/gscheck_pdfwrite.py", line 79, in runTest
    self.assertEqual(sum, gssum.get_sum(file2), "md5sum did not match baseline (" + file2 + ") for file: " + self.file)
  File "/home/regression/regression/gssum.py", line 43, in get_sum
    sum = db[file]
KeyError: Altona-Testsuite_p2_S_x3.pdf.pdf.pkmraw.300.0
======================================================================
ERROR: Checking pdfwrite of Altona.Page_3.2002-09-27.pdf (ppmraw/72dpi/noband) against baseline
----------------------------------------------------------------------
Traceback (most recent call last):
  File "/home/regression/regression/gscheck_pdfwrite.py", line 79, in runTest
    self.assertEqual(sum, gssum.get_sum(file2), "md5sum did not match baseline (" + file2 + ") for file: " + self.file)
  File "/home/regression/regression/gssum.py", line 43, in get_sum
    sum = db[file]
KeyError: Altona.Page_3.2002-09-27.pdf.pdf.ppmraw.72.0
======================================================================
ERROR: Checking pdfwrite of Altona.Page_3.2002-09-27.pdf (ppmraw/300dpi/noband) against baseline
----------------------------------------------------------------------
Traceback (most recent call last):
  File "/home/regression/regression/gscheck_pdfwrite.py", line 79, in runTest
    self.assertEqual(sum, gssum.get_sum(file2), "md5sum did not match baseline (" + file2 + ") for file: " + self.file)
  File "/home/regression/regression/gssum.py", line 43, in get_sum
    sum = db[file]
KeyError: Altona.Page_3.2002-09-27.pdf.pdf.ppmraw.300.0
======================================================================
ERROR: Checking pdfwrite of Altona.Page_3.2002-09-27.pdf (pkmraw/300dpi/noband) against baseline
----------------------------------------------------------------------
Traceback (most recent call last):
  File "/home/regression/regression/gscheck_pdfwrite.py", line 79, in runTest
    self.assertEqual(sum, gssum.get_sum(file2), "md5sum did not match baseline (" + file2 + ") for file: " + self.file)
  File "/home/regression/regression/gssum.py", line 43, in get_sum
    sum = db[file]
KeyError: Altona.Page_3.2002-09-27.pdf.pdf.pkmraw.300.0
======================================================================
ERROR: Checking pdfwrite of S2_Digitalproof-Forum_circles.pdf (ppmraw/72dpi/noband) against baseline
----------------------------------------------------------------------
Traceback (most recent call last):
  File "/home/regression/regression/gscheck_pdfwrite.py", line 79, in runTest
    self.assertEqual(sum, gssum.get_sum(file2), "md5sum did not match baseline (" + file2 + ") for file: " + self.file)
  File "/home/regression/regression/gssum.py", line 43, in get_sum
    sum = db[file]
KeyError: S2_Digitalproof-Forum_circles.pdf.pdf.ppmraw.72.0
======================================================================
ERROR: Checking pdfwrite of S2_Digitalproof-Forum_circles.pdf (ppmraw/300dpi/noband) against baseline
----------------------------------------------------------------------
Traceback (most recent call last):
  File "/home/regression/regression/gscheck_pdfwrite.py", line 79, in runTest
    self.assertEqual(sum, gssum.get_sum(file2), "md5sum did not match baseline (" + file2 + ") for file: " + self.file)
  File "/home/regression/regression/gssum.py", line 43, in get_sum
    sum = db[file]
KeyError: S2_Digitalproof-Forum_circles.pdf.pdf.ppmraw.300.0
======================================================================
ERROR: Checking pdfwrite of S2_Digitalproof-Forum_circles.pdf (pkmraw/300dpi/noband) against baseline
----------------------------------------------------------------------
Traceback (most recent call last):
  File "/home/regression/regression/gscheck_pdfwrite.py", line 79, in runTest
    self.assertEqual(sum, gssum.get_sum(file2), "md5sum did not match baseline (" + file2 + ") for file: " + self.file)
  File "/home/regression/regression/gssum.py", line 43, in get_sum
    sum = db[file]
KeyError: S2_Digitalproof-Forum_circles.pdf.pdf.pkmraw.300.0
======================================================================
ERROR: Checking pdfwrite of S2_Digitalproof-Forum_x3k.pdf (ppmraw/72dpi/noband) against baseline
----------------------------------------------------------------------
Traceback (most recent call last):
  File "/home/regression/regression/gscheck_pdfwrite.py", line 79, in runTest
    self.assertEqual(sum, gssum.get_sum(file2), "md5sum did not match baseline (" + file2 + ") for file: " + self.file)
  File "/home/regression/regression/gssum.py", line 43, in get_sum
    sum = db[file]
KeyError: S2_Digitalproof-Forum_x3k.pdf.pdf.ppmraw.72.0
======================================================================
ERROR: Checking pdfwrite of S2_Digitalproof-Forum_x3k.pdf (ppmraw/300dpi/noband) against baseline
----------------------------------------------------------------------
Traceback (most recent call last):
  File "/home/regression/regression/gscheck_pdfwrite.py", line 79, in runTest
    self.assertEqual(sum, gssum.get_sum(file2), "md5sum did not match baseline (" + file2 + ") for file: " + self.file)
  File "/home/regression/regression/gssum.py", line 43, in get_sum
    sum = db[file]
KeyError: S2_Digitalproof-Forum_x3k.pdf.pdf.ppmraw.300.0
======================================================================
ERROR: Checking pdfwrite of S2_Digitalproof-Forum_x3k.pdf (pkmraw/300dpi/noband) against baseline
----------------------------------------------------------------------
Traceback (most recent call last):
  File "/home/regression/regression/gscheck_pdfwrite.py", line 79, in runTest
    self.assertEqual(sum, gssum.get_sum(file2), "md5sum did not match baseline (" + file2 + ") for file: " + self.file)
  File "/home/regression/regression/gssum.py", line 43, in get_sum
    sum = db[file]
KeyError: S2_Digitalproof-Forum_x3k.pdf.pdf.pkmraw.300.0
======================================================================
ERROR: Checking pdfwrite of Testform.v1.0.2.pdf (ppmraw/72dpi/noband) against baseline
----------------------------------------------------------------------
Traceback (most recent call last):
  File "/home/regression/regression/gscheck_pdfwrite.py", line 79, in runTest
    self.assertEqual(sum, gssum.get_sum(file2), "md5sum did not match baseline (" + file2 + ") for file: " + self.file)
  File "/home/regression/regression/gssum.py", line 43, in get_sum
    sum = db[file]
KeyError: Testform.v1.0.2.pdf.pdf.ppmraw.72.0
======================================================================
ERROR: Checking pdfwrite of Testform.v1.0.2.pdf (ppmraw/300dpi/noband) against baseline
----------------------------------------------------------------------
Traceback (most recent call last):
  File "/home/regression/regression/gscheck_pdfwrite.py", line 79, in runTest
    self.assertEqual(sum, gssum.get_sum(file2), "md5sum did not match baseline (" + file2 + ") for file: " + self.file)
  File "/home/regression/regression/gssum.py", line 43, in get_sum
    sum = db[file]
KeyError: Testform.v1.0.2.pdf.pdf.ppmraw.300.0
======================================================================
ERROR: Checking pdfwrite of Testform.v1.0.2.pdf (pkmraw/300dpi/noband) against baseline
----------------------------------------------------------------------
Traceback (most recent call last):
  File "/home/regression/regression/gscheck_pdfwrite.py", line 79, in runTest
    self.assertEqual(sum, gssum.get_sum(file2), "md5sum did not match baseline (" + file2 + ") for file: " + self.file)
  File "/home/regression/regression/gssum.py", line 43, in get_sum
    sum = db[file]
KeyError: Testform.v1.0.2.pdf.pdf.pkmraw.300.0
======================================================================
FAIL: Checking Fixed_Original.pdf (pgmraw/300dpi/noband) against baseline
----------------------------------------------------------------------
md5sum did not match baseline (Fixed_Original.pdf.pgmraw.300.0) for file: /home/regression/comparefiles/Fixed_Original.pdf
======================================================================
FAIL: Checking Fixed_Original.pdf (pgmraw/300dpi/banded) against baseline
----------------------------------------------------------------------
md5sum did not match baseline (Fixed_Original.pdf.pgmraw.300.1) for file: /home/regression/comparefiles/Fixed_Original.pdf
======================================================================
FAIL: Checking Fixed_Original.pdf (ppmraw/300dpi/noband) against baseline
----------------------------------------------------------------------
md5sum did not match baseline (Fixed_Original.pdf.ppmraw.300.0) for file: /home/regression/comparefiles/Fixed_Original.pdf
======================================================================
FAIL: Checking Fixed_Original.pdf (ppmraw/300dpi/banded) against baseline
----------------------------------------------------------------------
md5sum did not match baseline (Fixed_Original.pdf.ppmraw.300.1) for file: /home/regression/comparefiles/Fixed_Original.pdf
======================================================================
FAIL: Checking Altona-Testsuite_p2_S_x3.pdf (pbmraw/72dpi/noband) against baseline
----------------------------------------------------------------------
md5sum did not match baseline (Altona-Testsuite_p2_S_x3.pdf.pbmraw.72.0) for file: /home/regression/comparefiles/Altona-Testsuite_p2_S_x3.pdf
======================================================================
FAIL: Checking Altona-Testsuite_p2_S_x3.pdf (pbmraw/72dpi/banded) against baseline
----------------------------------------------------------------------
md5sum did not match baseline (Altona-Testsuite_p2_S_x3.pdf.pbmraw.72.1) for file: /home/regression/comparefiles/Altona-Testsuite_p2_S_x3.pdf
======================================================================
FAIL: Checking Altona-Testsuite_p2_S_x3.pdf (pbmraw/300dpi/noband) against baseline
----------------------------------------------------------------------
md5sum did not match baseline (Altona-Testsuite_p2_S_x3.pdf.pbmraw.300.0) for file: /home/regression/comparefiles/Altona-Testsuite_p2_S_x3.pdf
======================================================================
FAIL: Checking Altona-Testsuite_p2_S_x3.pdf (pbmraw/300dpi/banded) against baseline
----------------------------------------------------------------------
md5sum did not match baseline (Altona-Testsuite_p2_S_x3.pdf.pbmraw.300.1) for file: /home/regression/comparefiles/Altona-Testsuite_p2_S_x3.pdf
======================================================================
FAIL: Checking Altona-Testsuite_p2_S_x3.pdf (pgmraw/72dpi/noband) against baseline
----------------------------------------------------------------------
md5sum did not match baseline (Altona-Testsuite_p2_S_x3.pdf.pgmraw.72.0) for file: /home/regression/comparefiles/Altona-Testsuite_p2_S_x3.pdf
======================================================================
FAIL: Checking Altona-Testsuite_p2_S_x3.pdf (pgmraw/72dpi/banded) against baseline
----------------------------------------------------------------------
md5sum did not match baseline (Altona-Testsuite_p2_S_x3.pdf.pgmraw.72.1) for file: /home/regression/comparefiles/Altona-Testsuite_p2_S_x3.pdf
======================================================================
FAIL: Checking Altona-Testsuite_p2_S_x3.pdf (pgmraw/300dpi/noband) against baseline
----------------------------------------------------------------------
md5sum did not match baseline (Altona-Testsuite_p2_S_x3.pdf.pgmraw.300.0) for file: /home/regression/comparefiles/Altona-Testsuite_p2_S_x3.pdf
======================================================================
FAIL: Checking Altona-Testsuite_p2_S_x3.pdf (pgmraw/300dpi/banded) against baseline
----------------------------------------------------------------------
md5sum did not match baseline (Altona-Testsuite_p2_S_x3.pdf.pgmraw.300.1) for file: /home/regression/comparefiles/Altona-Testsuite_p2_S_x3.pdf
======================================================================
FAIL: Checking Altona-Testsuite_p2_S_x3.pdf (ppmraw/72dpi/noband) against baseline
----------------------------------------------------------------------
md5sum did not match baseline (Altona-Testsuite_p2_S_x3.pdf.ppmraw.72.0) for file: /home/regression/comparefiles/Altona-Testsuite_p2_S_x3.pdf
======================================================================
FAIL: Checking Altona-Testsuite_p2_S_x3.pdf (ppmraw/72dpi/banded) against baseline
----------------------------------------------------------------------
md5sum did not match baseline (Altona-Testsuite_p2_S_x3.pdf.ppmraw.72.1) for file: /home/regression/comparefiles/Altona-Testsuite_p2_S_x3.pdf
======================================================================
FAIL: Checking Altona-Testsuite_p2_S_x3.pdf (ppmraw/300dpi/noband) against baseline
----------------------------------------------------------------------
md5sum did not match baseline (Altona-Testsuite_p2_S_x3.pdf.ppmraw.300.0) for file: /home/regression/comparefiles/Altona-Testsuite_p2_S_x3.pdf
======================================================================
FAIL: Checking Altona-Testsuite_p2_S_x3.pdf (ppmraw/300dpi/banded) against baseline
----------------------------------------------------------------------
md5sum did not match baseline (Altona-Testsuite_p2_S_x3.pdf.ppmraw.300.1) for file: /home/regression/comparefiles/Altona-Testsuite_p2_S_x3.pdf
======================================================================
FAIL: Checking Altona-Testsuite_p2_S_x3.pdf (pkmraw/72dpi/noband) against baseline
----------------------------------------------------------------------
md5sum did not match baseline (Altona-Testsuite_p2_S_x3.pdf.pkmraw.72.0) for file: /home/regression/comparefiles/Altona-Testsuite_p2_S_x3.pdf
======================================================================
FAIL: Checking Altona-Testsuite_p2_S_x3.pdf (pkmraw/72dpi/banded) against baseline
----------------------------------------------------------------------
md5sum did not match baseline (Altona-Testsuite_p2_S_x3.pdf.pkmraw.72.1) for file: /home/regression/comparefiles/Altona-Testsuite_p2_S_x3.pdf
======================================================================
FAIL: Checking Altona-Testsuite_p2_S_x3.pdf (pkmraw/300dpi/noband) against baseline
----------------------------------------------------------------------
md5sum did not match baseline (Altona-Testsuite_p2_S_x3.pdf.pkmraw.300.0) for file: /home/regression/comparefiles/Altona-Testsuite_p2_S_x3.pdf
======================================================================
FAIL: Checking Altona-Testsuite_p2_S_x3.pdf (pkmraw/300dpi/banded) against baseline
----------------------------------------------------------------------
md5sum did not match baseline (Altona-Testsuite_p2_S_x3.pdf.pkmraw.300.1) for file: /home/regression/comparefiles/Altona-Testsuite_p2_S_x3.pdf
======================================================================
FAIL: Checking Altona.Page_3.2002-09-27.pdf (pbmraw/72dpi/noband) against baseline
----------------------------------------------------------------------
md5sum did not match baseline (Altona.Page_3.2002-09-27.pdf.pbmraw.72.0) for file: /home/regression/comparefiles/Altona.Page_3.2002-09-27.pdf
======================================================================
FAIL: Checking Altona.Page_3.2002-09-27.pdf (pbmraw/72dpi/banded) against baseline
----------------------------------------------------------------------
md5sum did not match baseline (Altona.Page_3.2002-09-27.pdf.pbmraw.72.1) for file: /home/regression/comparefiles/Altona.Page_3.2002-09-27.pdf
======================================================================
FAIL: Checking Altona.Page_3.2002-09-27.pdf (pbmraw/300dpi/noband) against baseline
----------------------------------------------------------------------
md5sum did not match baseline (Altona.Page_3.2002-09-27.pdf.pbmraw.300.0) for file: /home/regression/comparefiles/Altona.Page_3.2002-09-27.pdf
======================================================================
FAIL: Checking Altona.Page_3.2002-09-27.pdf (pbmraw/300dpi/banded) against baseline
----------------------------------------------------------------------
md5sum did not match baseline (Altona.Page_3.2002-09-27.pdf.pbmraw.300.1) for file: /home/regression/comparefiles/Altona.Page_3.2002-09-27.pdf
======================================================================
FAIL: Checking Altona.Page_3.2002-09-27.pdf (pgmraw/72dpi/noband) against baseline
----------------------------------------------------------------------
md5sum did not match baseline (Altona.Page_3.2002-09-27.pdf.pgmraw.72.0) for file: /home/regression/comparefiles/Altona.Page_3.2002-09-27.pdf
======================================================================
FAIL: Checking Altona.Page_3.2002-09-27.pdf (pgmraw/72dpi/banded) against baseline
----------------------------------------------------------------------
md5sum did not match baseline (Altona.Page_3.2002-09-27.pdf.pgmraw.72.1) for file: /home/regression/comparefiles/Altona.Page_3.2002-09-27.pdf
======================================================================
FAIL: Checking Altona.Page_3.2002-09-27.pdf (pgmraw/300dpi/noband) against baseline
----------------------------------------------------------------------
md5sum did not match baseline (Altona.Page_3.2002-09-27.pdf.pgmraw.300.0) for file: /home/regression/comparefiles/Altona.Page_3.2002-09-27.pdf
======================================================================
FAIL: Checking Altona.Page_3.2002-09-27.pdf (pgmraw/300dpi/banded) against baseline
----------------------------------------------------------------------
md5sum did not match baseline (Altona.Page_3.2002-09-27.pdf.pgmraw.300.1) for file: /home/regression/comparefiles/Altona.Page_3.2002-09-27.pdf
======================================================================
FAIL: Checking Altona.Page_3.2002-09-27.pdf (ppmraw/72dpi/noband) against baseline
----------------------------------------------------------------------
md5sum did not match baseline (Altona.Page_3.2002-09-27.pdf.ppmraw.72.0) for file: /home/regression/comparefiles/Altona.Page_3.2002-09-27.pdf
======================================================================
FAIL: Checking Altona.Page_3.2002-09-27.pdf (ppmraw/72dpi/banded) against baseline
----------------------------------------------------------------------
md5sum did not match baseline (Altona.Page_3.2002-09-27.pdf.ppmraw.72.1) for file: /home/regression/comparefiles/Altona.Page_3.2002-09-27.pdf
======================================================================
FAIL: Checking Altona.Page_3.2002-09-27.pdf (ppmraw/300dpi/noband) against baseline
----------------------------------------------------------------------
md5sum did not match baseline (Altona.Page_3.2002-09-27.pdf.ppmraw.300.0) for file: /home/regression/comparefiles/Altona.Page_3.2002-09-27.pdf
======================================================================
FAIL: Checking Altona.Page_3.2002-09-27.pdf (ppmraw/300dpi/banded) against baseline
----------------------------------------------------------------------
md5sum did not match baseline (Altona.Page_3.2002-09-27.pdf.ppmraw.300.1) for file: /home/regression/comparefiles/Altona.Page_3.2002-09-27.pdf
======================================================================
FAIL: Checking Altona.Page_3.2002-09-27.pdf (pkmraw/72dpi/noband) against baseline
----------------------------------------------------------------------
md5sum did not match baseline (Altona.Page_3.2002-09-27.pdf.pkmraw.72.0) for file: /home/regression/comparefiles/Altona.Page_3.2002-09-27.pdf
======================================================================
FAIL: Checking Altona.Page_3.2002-09-27.pdf (pkmraw/72dpi/banded) against baseline
----------------------------------------------------------------------
md5sum did not match baseline (Altona.Page_3.2002-09-27.pdf.pkmraw.72.1) for file: /home/regression/comparefiles/Altona.Page_3.2002-09-27.pdf
======================================================================
FAIL: Checking Altona.Page_3.2002-09-27.pdf (pkmraw/300dpi/noband) against baseline
----------------------------------------------------------------------
md5sum did not match baseline (Altona.Page_3.2002-09-27.pdf.pkmraw.300.0) for file: /home/regression/comparefiles/Altona.Page_3.2002-09-27.pdf
======================================================================
FAIL: Checking Altona.Page_3.2002-09-27.pdf (pkmraw/300dpi/banded) against baseline
----------------------------------------------------------------------
md5sum did not match baseline (Altona.Page_3.2002-09-27.pdf.pkmraw.300.1) for file: /home/regression/comparefiles/Altona.Page_3.2002-09-27.pdf
======================================================================
FAIL: Checking S2_Digitalproof-Forum_x3k.pdf (pbmraw/72dpi/noband) against baseline
----------------------------------------------------------------------
md5sum did not match baseline (S2_Digitalproof-Forum_x3k.pdf.pbmraw.72.0) for file: /home/regression/comparefiles/S2_Digitalproof-Forum_x3k.pdf
======================================================================
FAIL: Checking S2_Digitalproof-Forum_x3k.pdf (pbmraw/72dpi/banded) against baseline
----------------------------------------------------------------------
md5sum did not match baseline (S2_Digitalproof-Forum_x3k.pdf.pbmraw.72.1) for file: /home/regression/comparefiles/S2_Digitalproof-Forum_x3k.pdf
======================================================================
FAIL: Checking S2_Digitalproof-Forum_x3k.pdf (pbmraw/300dpi/noband) against baseline
----------------------------------------------------------------------
md5sum did not match baseline (S2_Digitalproof-Forum_x3k.pdf.pbmraw.300.0) for file: /home/regression/comparefiles/S2_Digitalproof-Forum_x3k.pdf
======================================================================
FAIL: Checking S2_Digitalproof-Forum_x3k.pdf (pbmraw/300dpi/banded) against baseline
----------------------------------------------------------------------
md5sum did not match baseline (S2_Digitalproof-Forum_x3k.pdf.pbmraw.300.1) for file: /home/regression/comparefiles/S2_Digitalproof-Forum_x3k.pdf
======================================================================
FAIL: Checking S2_Digitalproof-Forum_x3k.pdf (pgmraw/72dpi/noband) against baseline
----------------------------------------------------------------------
md5sum did not match baseline (S2_Digitalproof-Forum_x3k.pdf.pgmraw.72.0) for file: /home/regression/comparefiles/S2_Digitalproof-Forum_x3k.pdf
======================================================================
FAIL: Checking S2_Digitalproof-Forum_x3k.pdf (pgmraw/72dpi/banded) against baseline
----------------------------------------------------------------------
md5sum did not match baseline (S2_Digitalproof-Forum_x3k.pdf.pgmraw.72.1) for file: /home/regression/comparefiles/S2_Digitalproof-Forum_x3k.pdf
======================================================================
FAIL: Checking S2_Digitalproof-Forum_x3k.pdf (pgmraw/300dpi/noband) against baseline
----------------------------------------------------------------------
md5sum did not match baseline (S2_Digitalproof-Forum_x3k.pdf.pgmraw.300.0) for file: /home/regression/comparefiles/S2_Digitalproof-Forum_x3k.pdf
======================================================================
FAIL: Checking S2_Digitalproof-Forum_x3k.pdf (pgmraw/300dpi/banded) against baseline
----------------------------------------------------------------------
md5sum did not match baseline (S2_Digitalproof-Forum_x3k.pdf.pgmraw.300.1) for file: /home/regression/comparefiles/S2_Digitalproof-Forum_x3k.pdf
======================================================================
FAIL: Checking S2_Digitalproof-Forum_x3k.pdf (ppmraw/72dpi/noband) against baseline
----------------------------------------------------------------------
md5sum did not match baseline (S2_Digitalproof-Forum_x3k.pdf.ppmraw.72.0) for file: /home/regression/comparefiles/S2_Digitalproof-Forum_x3k.pdf
======================================================================
FAIL: Checking S2_Digitalproof-Forum_x3k.pdf (ppmraw/72dpi/banded) against baseline
----------------------------------------------------------------------
md5sum did not match baseline (S2_Digitalproof-Forum_x3k.pdf.ppmraw.72.1) for file: /home/regression/comparefiles/S2_Digitalproof-Forum_x3k.pdf
======================================================================
FAIL: Checking S2_Digitalproof-Forum_x3k.pdf (ppmraw/300dpi/noband) against baseline
----------------------------------------------------------------------
md5sum did not match baseline (S2_Digitalproof-Forum_x3k.pdf.ppmraw.300.0) for file: /home/regression/comparefiles/S2_Digitalproof-Forum_x3k.pdf
======================================================================
FAIL: Checking S2_Digitalproof-Forum_x3k.pdf (ppmraw/300dpi/banded) against baseline
----------------------------------------------------------------------
md5sum did not match baseline (S2_Digitalproof-Forum_x3k.pdf.ppmraw.300.1) for file: /home/regression/comparefiles/S2_Digitalproof-Forum_x3k.pdf
======================================================================
FAIL: Checking S2_Digitalproof-Forum_x3k.pdf (pkmraw/72dpi/noband) against baseline
----------------------------------------------------------------------
md5sum did not match baseline (S2_Digitalproof-Forum_x3k.pdf.pkmraw.72.0) for file: /home/regression/comparefiles/S2_Digitalproof-Forum_x3k.pdf
======================================================================
FAIL: Checking S2_Digitalproof-Forum_x3k.pdf (pkmraw/72dpi/banded) against baseline
----------------------------------------------------------------------
md5sum did not match baseline (S2_Digitalproof-Forum_x3k.pdf.pkmraw.72.1) for file: /home/regression/comparefiles/S2_Digitalproof-Forum_x3k.pdf
======================================================================
FAIL: Checking S2_Digitalproof-Forum_x3k.pdf (pkmraw/300dpi/noband) against baseline
----------------------------------------------------------------------
md5sum did not match baseline (S2_Digitalproof-Forum_x3k.pdf.pkmraw.300.0) for file: /home/regression/comparefiles/S2_Digitalproof-Forum_x3k.pdf
======================================================================
FAIL: Checking S2_Digitalproof-Forum_x3k.pdf (pkmraw/300dpi/banded) against baseline
----------------------------------------------------------------------
md5sum did not match baseline (S2_Digitalproof-Forum_x3k.pdf.pkmraw.300.1) for file: /home/regression/comparefiles/S2_Digitalproof-Forum_x3k.pdf
======================================================================
FAIL: Checking Testform.v1.0.2.pdf (pbmraw/72dpi/noband) against baseline
----------------------------------------------------------------------
md5sum did not match baseline (Testform.v1.0.2.pdf.pbmraw.72.0) for file: /home/regression/comparefiles/Testform.v1.0.2.pdf
======================================================================
FAIL: Checking Testform.v1.0.2.pdf (pbmraw/72dpi/banded) against baseline
----------------------------------------------------------------------
md5sum did not match baseline (Testform.v1.0.2.pdf.pbmraw.72.1) for file: /home/regression/comparefiles/Testform.v1.0.2.pdf
======================================================================
FAIL: Checking Testform.v1.0.2.pdf (pbmraw/300dpi/noband) against baseline
----------------------------------------------------------------------
md5sum did not match baseline (Testform.v1.0.2.pdf.pbmraw.300.0) for file: /home/regression/comparefiles/Testform.v1.0.2.pdf
======================================================================
FAIL: Checking Testform.v1.0.2.pdf (pbmraw/300dpi/banded) against baseline
----------------------------------------------------------------------
md5sum did not match baseline (Testform.v1.0.2.pdf.pbmraw.300.1) for file: /home/regression/comparefiles/Testform.v1.0.2.pdf
======================================================================
FAIL: Checking Testform.v1.0.2.pdf (pgmraw/72dpi/noband) against baseline
----------------------------------------------------------------------
md5sum did not match baseline (Testform.v1.0.2.pdf.pgmraw.72.0) for file: /home/regression/comparefiles/Testform.v1.0.2.pdf
======================================================================
FAIL: Checking Testform.v1.0.2.pdf (pgmraw/72dpi/banded) against baseline
----------------------------------------------------------------------
md5sum did not match baseline (Testform.v1.0.2.pdf.pgmraw.72.1) for file: /home/regression/comparefiles/Testform.v1.0.2.pdf
======================================================================
FAIL: Checking Testform.v1.0.2.pdf (pgmraw/300dpi/noband) against baseline
----------------------------------------------------------------------
md5sum did not match baseline (Testform.v1.0.2.pdf.pgmraw.300.0) for file: /home/regression/comparefiles/Testform.v1.0.2.pdf
======================================================================
FAIL: Checking Testform.v1.0.2.pdf (pgmraw/300dpi/banded) against baseline
----------------------------------------------------------------------
md5sum did not match baseline (Testform.v1.0.2.pdf.pgmraw.300.1) for file: /home/regression/comparefiles/Testform.v1.0.2.pdf
======================================================================
FAIL: Checking Testform.v1.0.2.pdf (ppmraw/72dpi/noband) against baseline
----------------------------------------------------------------------
md5sum did not match baseline (Testform.v1.0.2.pdf.ppmraw.72.0) for file: /home/regression/comparefiles/Testform.v1.0.2.pdf
======================================================================
FAIL: Checking Testform.v1.0.2.pdf (ppmraw/72dpi/banded) against baseline
----------------------------------------------------------------------
md5sum did not match baseline (Testform.v1.0.2.pdf.ppmraw.72.1) for file: /home/regression/comparefiles/Testform.v1.0.2.pdf
======================================================================
FAIL: Checking Testform.v1.0.2.pdf (ppmraw/300dpi/noband) against baseline
----------------------------------------------------------------------
md5sum did not match baseline (Testform.v1.0.2.pdf.ppmraw.300.0) for file: /home/regression/comparefiles/Testform.v1.0.2.pdf
======================================================================
FAIL: Checking Testform.v1.0.2.pdf (ppmraw/300dpi/banded) against baseline
----------------------------------------------------------------------
md5sum did not match baseline (Testform.v1.0.2.pdf.ppmraw.300.1) for file: /home/regression/comparefiles/Testform.v1.0.2.pdf
======================================================================
FAIL: Checking Testform.v1.0.2.pdf (pkmraw/72dpi/noband) against baseline
----------------------------------------------------------------------
md5sum did not match baseline (Testform.v1.0.2.pdf.pkmraw.72.0) for file: /home/regression/comparefiles/Testform.v1.0.2.pdf
======================================================================
FAIL: Checking Testform.v1.0.2.pdf (pkmraw/72dpi/banded) against baseline
----------------------------------------------------------------------
md5sum did not match baseline (Testform.v1.0.2.pdf.pkmraw.72.1) for file: /home/regression/comparefiles/Testform.v1.0.2.pdf
======================================================================
FAIL: Checking Testform.v1.0.2.pdf (pkmraw/300dpi/noband) against baseline
----------------------------------------------------------------------
md5sum did not match baseline (Testform.v1.0.2.pdf.pkmraw.300.0) for file: /home/regression/comparefiles/Testform.v1.0.2.pdf
======================================================================
FAIL: Checking Testform.v1.0.2.pdf (pkmraw/300dpi/banded) against baseline
----------------------------------------------------------------------
md5sum did not match baseline (Testform.v1.0.2.pdf.pkmraw.300.1) for file: /home/regression/comparefiles/Testform.v1.0.2.pdf
======================================================================
FAIL: Checking pdfwrite of 321-05.ps (ppmraw/300dpi/noband) against baseline
----------------------------------------------------------------------
md5sum did not match baseline (321-05.ps.pdf.ppmraw.300.0) for file: /home/regression/comparefiles/321-05.ps
======================================================================
FAIL: Checking pdfwrite of 321-05.ps (pkmraw/300dpi/noband) against baseline
----------------------------------------------------------------------
md5sum did not match baseline (321-05.ps.pdf.pkmraw.300.0) for file: /home/regression/comparefiles/321-05.ps
======================================================================
FAIL: Checking pdfwrite of Fixed_Original.pdf (ppmraw/300dpi/noband) against baseline
----------------------------------------------------------------------
md5sum did not match baseline (Fixed_Original.pdf.pdf.ppmraw.300.0) for file: /home/regression/comparefiles/Fixed_Original.pdf
======================================================================
FAIL: Checking pdfwrite of QA_Inv.pdf (ppmraw/72dpi/noband) against baseline
----------------------------------------------------------------------
md5sum did not match baseline (QA_Inv.pdf.pdf.ppmraw.72.0) for file: /home/regression/comparefiles/QA_Inv.pdf
======================================================================
FAIL: Checking pdfwrite of QA_Inv.pdf (ppmraw/300dpi/noband) against baseline
----------------------------------------------------------------------
md5sum did not match baseline (QA_Inv.pdf.pdf.ppmraw.300.0) for file: /home/regression/comparefiles/QA_Inv.pdf
======================================================================
FAIL: Checking pdfwrite of QA_Inv.pdf (pkmraw/300dpi/noband) against baseline
----------------------------------------------------------------------
md5sum did not match baseline (QA_Inv.pdf.pdf.pkmraw.300.0) for file: /home/regression/comparefiles/QA_Inv.pdf
======================================================================
FAIL: Checking pdfwrite of gs.anotherfailure.pdf (ppmraw/72dpi/noband) against baseline
----------------------------------------------------------------------
md5sum did not match baseline (gs.anotherfailure.pdf.pdf.ppmraw.72.0) for file: /home/regression/comparefiles/gs.anotherfailure.pdf
======================================================================
FAIL: Checking pdfwrite of gs.anotherfailure.pdf (ppmraw/300dpi/noband) against baseline
----------------------------------------------------------------------
md5sum did not match baseline (gs.anotherfailure.pdf.pdf.ppmraw.300.0) for file: /home/regression/comparefiles/gs.anotherfailure.pdf
======================================================================
FAIL: Checking pdfwrite of gs.anotherfailure.pdf (pkmraw/300dpi/noband) against baseline
----------------------------------------------------------------------
md5sum did not match baseline (gs.anotherfailure.pdf.pdf.pkmraw.300.0) for file: /home/regression/comparefiles/gs.anotherfailure.pdf
======================================================================
FAIL: Checking pdfwrite of gs5.98-dragon.pdf (ppmraw/72dpi/noband) against baseline
----------------------------------------------------------------------
md5sum did not match baseline (gs5.98-dragon.pdf.pdf.ppmraw.72.0) for file: /home/regression/comparefiles/gs5.98-dragon.pdf
======================================================================
FAIL: Checking pdfwrite of gs5.98-dragon.pdf (ppmraw/300dpi/noband) against baseline
----------------------------------------------------------------------
md5sum did not match baseline (gs5.98-dragon.pdf.pdf.ppmraw.300.0) for file: /home/regression/comparefiles/gs5.98-dragon.pdf
======================================================================
FAIL: Checking pdfwrite of gs5.98-dragon.pdf (pkmraw/300dpi/noband) against baseline
----------------------------------------------------------------------
md5sum did not match baseline (gs5.98-dragon.pdf.pdf.pkmraw.300.0) for file: /home/regression/comparefiles/gs5.98-dragon.pdf
======================================================================
FAIL: Checking pdfwrite of kazmir.pdf (ppmraw/72dpi/noband) against baseline
----------------------------------------------------------------------
md5sum did not match baseline (kazmir.pdf.pdf.ppmraw.72.0) for file: /home/regression/comparefiles/kazmir.pdf
======================================================================
FAIL: Checking pdfwrite of kazmir.pdf (ppmraw/300dpi/noband) against baseline
----------------------------------------------------------------------
md5sum did not match baseline (kazmir.pdf.pdf.ppmraw.300.0) for file: /home/regression/comparefiles/kazmir.pdf
======================================================================
FAIL: Checking pdfwrite of kazmir.pdf (pkmraw/300dpi/noband) against baseline
----------------------------------------------------------------------
md5sum did not match baseline (kazmir.pdf.pdf.pkmraw.300.0) for file: /home/regression/comparefiles/kazmir.pdf
======================================================================
FAIL: Checking pdfwrite of knight.pdf (ppmraw/300dpi/noband) against baseline
----------------------------------------------------------------------
md5sum did not match baseline (knight.pdf.pdf.ppmraw.300.0) for file: /home/regression/comparefiles/knight.pdf
======================================================================
FAIL: Checking pdfwrite of knight.pdf (pkmraw/300dpi/noband) against baseline
----------------------------------------------------------------------
md5sum did not match baseline (knight.pdf.pdf.pkmraw.300.0) for file: /home/regression/comparefiles/knight.pdf
======================================================================
FAIL: Checking pdfwrite of test2.pdf (ppmraw/72dpi/noband) against baseline
----------------------------------------------------------------------
md5sum did not match baseline (test2.pdf.pdf.ppmraw.72.0) for file: /home/regression/comparefiles/test2.pdf
======================================================================
FAIL: Checking pdfwrite of CAT_LOGO.ps (ppmraw/72dpi/noband) against baseline
----------------------------------------------------------------------
md5sum did not match baseline (CAT_LOGO.ps.pdf.ppmraw.72.0) for file: /home/regression/comparefiles/CAT_LOGO.ps
======================================================================
FAIL: Checking pdfwrite of CAT_LOGO.ps (ppmraw/300dpi/noband) against baseline
----------------------------------------------------------------------
md5sum did not match baseline (CAT_LOGO.ps.pdf.ppmraw.300.0) for file: /home/regression/comparefiles/CAT_LOGO.ps
======================================================================
FAIL: Checking pdfwrite of CAT_LOGO.ps (pkmraw/300dpi/noband) against baseline
----------------------------------------------------------------------
md5sum did not match baseline (CAT_LOGO.ps.pdf.pkmraw.300.0) for file: /home/regression/comparefiles/CAT_LOGO.ps
----------------------------------------------------------------------
Ran 7027 tests in 9637.990s

FAILED (failures=89, errors=31)