[gs-regression] gs regression report - 2002-10-25

regression@casper.ghostscript.com regression@casper.ghostscript.com
Fri, 25 Oct 2002 05:47:25 -0700


The following regression changes happened since yesterday's report:
Traceback (most recent call last):
  File "/home/regression/regression/testdiff", line 130, in ?
    if end_db[k] != baseline_db[k]:
KeyError: doretree.ps.pbmraw.72.1


The complete list of regressions for today:
Checking Fixed_Original.pdf (pgmraw/300dpi/noband) against baseline ... DIFFER
Checking Fixed_Original.pdf (pgmraw/300dpi/banded) against baseline ... DIFFER
Checking Fixed_Original.pdf (ppmraw/300dpi/noband) against baseline ... DIFFER
Checking Fixed_Original.pdf (ppmraw/300dpi/banded) against baseline ... DIFFER
Checking Altona-Testsuite_p2_S_x3.pdf (pbmraw/72dpi/noband) against baseline ... DIFFER
Checking Altona-Testsuite_p2_S_x3.pdf (pbmraw/72dpi/banded) against baseline ... DIFFER
Checking Altona-Testsuite_p2_S_x3.pdf (pbmraw/300dpi/noband) against baseline ... DIFFER
Checking Altona-Testsuite_p2_S_x3.pdf (pbmraw/300dpi/banded) against baseline ... DIFFER
Checking Altona-Testsuite_p2_S_x3.pdf (pgmraw/72dpi/noband) against baseline ... DIFFER
Checking Altona-Testsuite_p2_S_x3.pdf (pgmraw/72dpi/banded) against baseline ... DIFFER
Checking Altona-Testsuite_p2_S_x3.pdf (pgmraw/300dpi/noband) against baseline ... DIFFER
Checking Altona-Testsuite_p2_S_x3.pdf (pgmraw/300dpi/banded) against baseline ... DIFFER
Checking Altona-Testsuite_p2_S_x3.pdf (ppmraw/72dpi/noband) against baseline ... DIFFER
Checking Altona-Testsuite_p2_S_x3.pdf (ppmraw/72dpi/banded) against baseline ... DIFFER
Checking Altona-Testsuite_p2_S_x3.pdf (ppmraw/300dpi/noband) against baseline ... DIFFER
Checking Altona-Testsuite_p2_S_x3.pdf (ppmraw/300dpi/banded) against baseline ... DIFFER
Checking Altona-Testsuite_p2_S_x3.pdf (pkmraw/72dpi/noband) against baseline ... DIFFER
Checking Altona-Testsuite_p2_S_x3.pdf (pkmraw/72dpi/banded) against baseline ... DIFFER
Checking Altona-Testsuite_p2_S_x3.pdf (pkmraw/300dpi/noband) against baseline ... DIFFER
Checking Altona-Testsuite_p2_S_x3.pdf (pkmraw/300dpi/banded) against baseline ... DIFFER
Checking Altona.Page_3.2002-09-27.pdf (pbmraw/72dpi/noband) against baseline ... DIFFER
Checking Altona.Page_3.2002-09-27.pdf (pbmraw/72dpi/banded) against baseline ... DIFFER
Checking Altona.Page_3.2002-09-27.pdf (pbmraw/300dpi/noband) against baseline ... DIFFER
Checking Altona.Page_3.2002-09-27.pdf (pbmraw/300dpi/banded) against baseline ... DIFFER
Checking Altona.Page_3.2002-09-27.pdf (pgmraw/72dpi/noband) against baseline ... DIFFER
Checking Altona.Page_3.2002-09-27.pdf (pgmraw/72dpi/banded) against baseline ... DIFFER
Checking Altona.Page_3.2002-09-27.pdf (pgmraw/300dpi/noband) against baseline ... DIFFER
Checking Altona.Page_3.2002-09-27.pdf (pgmraw/300dpi/banded) against baseline ... DIFFER
Checking Altona.Page_3.2002-09-27.pdf (ppmraw/72dpi/noband) against baseline ... DIFFER
Checking Altona.Page_3.2002-09-27.pdf (ppmraw/72dpi/banded) against baseline ... DIFFER
Checking Altona.Page_3.2002-09-27.pdf (ppmraw/300dpi/noband) against baseline ... DIFFER
Checking Altona.Page_3.2002-09-27.pdf (ppmraw/300dpi/banded) against baseline ... DIFFER
Checking Altona.Page_3.2002-09-27.pdf (pkmraw/72dpi/noband) against baseline ... DIFFER
Checking Altona.Page_3.2002-09-27.pdf (pkmraw/72dpi/banded) against baseline ... DIFFER
Checking Altona.Page_3.2002-09-27.pdf (pkmraw/300dpi/noband) against baseline ... DIFFER
Checking Altona.Page_3.2002-09-27.pdf (pkmraw/300dpi/banded) against baseline ... DIFFER
Checking S2_Digitalproof-Forum_circles.pdf (pbmraw/72dpi/noband) against baseline ... ERROR
Checking S2_Digitalproof-Forum_circles.pdf (pbmraw/72dpi/banded) against baseline ... ERROR
Checking S2_Digitalproof-Forum_circles.pdf (pbmraw/300dpi/noband) against baseline ... ERROR
Checking S2_Digitalproof-Forum_circles.pdf (pbmraw/300dpi/banded) against baseline ... ERROR
Checking S2_Digitalproof-Forum_circles.pdf (pgmraw/72dpi/noband) against baseline ... ERROR
Checking S2_Digitalproof-Forum_circles.pdf (pgmraw/72dpi/banded) against baseline ... ERROR
Checking S2_Digitalproof-Forum_circles.pdf (pgmraw/300dpi/noband) against baseline ... ERROR
Checking S2_Digitalproof-Forum_circles.pdf (pgmraw/300dpi/banded) against baseline ... ERROR
Checking S2_Digitalproof-Forum_circles.pdf (ppmraw/72dpi/noband) against baseline ... ERROR
Checking S2_Digitalproof-Forum_circles.pdf (ppmraw/72dpi/banded) against baseline ... ERROR
Checking S2_Digitalproof-Forum_circles.pdf (ppmraw/300dpi/noband) against baseline ... ERROR
Checking S2_Digitalproof-Forum_circles.pdf (ppmraw/300dpi/banded) against baseline ... ERROR
Checking S2_Digitalproof-Forum_circles.pdf (pkmraw/72dpi/noband) against baseline ... ERROR
Checking S2_Digitalproof-Forum_circles.pdf (pkmraw/72dpi/banded) against baseline ... ERROR
Checking S2_Digitalproof-Forum_circles.pdf (pkmraw/300dpi/noband) against baseline ... ERROR
Checking S2_Digitalproof-Forum_circles.pdf (pkmraw/300dpi/banded) against baseline ... ERROR
Checking S2_Digitalproof-Forum_x3k.pdf (pbmraw/72dpi/noband) against baseline ... DIFFER
Checking S2_Digitalproof-Forum_x3k.pdf (pbmraw/72dpi/banded) against baseline ... DIFFER
Checking S2_Digitalproof-Forum_x3k.pdf (pbmraw/300dpi/noband) against baseline ... DIFFER
Checking S2_Digitalproof-Forum_x3k.pdf (pbmraw/300dpi/banded) against baseline ... DIFFER
Checking S2_Digitalproof-Forum_x3k.pdf (pgmraw/72dpi/noband) against baseline ... DIFFER
Checking S2_Digitalproof-Forum_x3k.pdf (pgmraw/72dpi/banded) against baseline ... DIFFER
Checking S2_Digitalproof-Forum_x3k.pdf (pgmraw/300dpi/noband) against baseline ... DIFFER
Checking S2_Digitalproof-Forum_x3k.pdf (pgmraw/300dpi/banded) against baseline ... DIFFER
Checking S2_Digitalproof-Forum_x3k.pdf (ppmraw/72dpi/noband) against baseline ... DIFFER
Checking S2_Digitalproof-Forum_x3k.pdf (ppmraw/72dpi/banded) against baseline ... DIFFER
Checking S2_Digitalproof-Forum_x3k.pdf (ppmraw/300dpi/noband) against baseline ... DIFFER
Checking S2_Digitalproof-Forum_x3k.pdf (ppmraw/300dpi/banded) against baseline ... DIFFER
Checking S2_Digitalproof-Forum_x3k.pdf (pkmraw/72dpi/noband) against baseline ... DIFFER
Checking S2_Digitalproof-Forum_x3k.pdf (pkmraw/72dpi/banded) against baseline ... DIFFER
Checking S2_Digitalproof-Forum_x3k.pdf (pkmraw/300dpi/noband) against baseline ... DIFFER
Checking S2_Digitalproof-Forum_x3k.pdf (pkmraw/300dpi/banded) against baseline ... DIFFER
Checking Testform.v1.0.2.pdf (pbmraw/72dpi/noband) against baseline ... DIFFER
Checking Testform.v1.0.2.pdf (pbmraw/72dpi/banded) against baseline ... DIFFER
Checking Testform.v1.0.2.pdf (pbmraw/300dpi/noband) against baseline ... DIFFER
Checking Testform.v1.0.2.pdf (pbmraw/300dpi/banded) against baseline ... DIFFER
Checking Testform.v1.0.2.pdf (pgmraw/72dpi/noband) against baseline ... DIFFER
Checking Testform.v1.0.2.pdf (pgmraw/72dpi/banded) against baseline ... DIFFER
Checking Testform.v1.0.2.pdf (pgmraw/300dpi/noband) against baseline ... DIFFER
Checking Testform.v1.0.2.pdf (pgmraw/300dpi/banded) against baseline ... DIFFER
Checking Testform.v1.0.2.pdf (ppmraw/72dpi/noband) against baseline ... DIFFER
Checking Testform.v1.0.2.pdf (ppmraw/72dpi/banded) against baseline ... DIFFER
Checking Testform.v1.0.2.pdf (ppmraw/300dpi/noband) against baseline ... DIFFER
Checking Testform.v1.0.2.pdf (ppmraw/300dpi/banded) against baseline ... DIFFER
Checking Testform.v1.0.2.pdf (pkmraw/72dpi/noband) against baseline ... DIFFER
Checking Testform.v1.0.2.pdf (pkmraw/72dpi/banded) against baseline ... DIFFER
Checking Testform.v1.0.2.pdf (pkmraw/300dpi/noband) against baseline ... DIFFER
Checking Testform.v1.0.2.pdf (pkmraw/300dpi/banded) against baseline ... DIFFER
Checking Es001-01.pdf (pbmraw/72dpi/noband) against baseline ... ERROR
Checking Es001-01.pdf (pbmraw/72dpi/banded) against baseline ... ERROR
Checking Es001-01.pdf (pbmraw/300dpi/noband) against baseline ... ERROR
Checking Es001-01.pdf (pbmraw/300dpi/banded) against baseline ... ERROR
Checking Es001-01.pdf (pgmraw/72dpi/noband) against baseline ... ERROR
Checking Es001-01.pdf (pgmraw/72dpi/banded) against baseline ... ERROR
Checking Es001-01.pdf (pgmraw/300dpi/noband) against baseline ... ERROR
Checking Es001-01.pdf (pgmraw/300dpi/banded) against baseline ... ERROR
Checking Es001-01.pdf (ppmraw/72dpi/noband) against baseline ... ERROR
Checking Es001-01.pdf (ppmraw/72dpi/banded) against baseline ... ERROR
Checking Es001-01.pdf (ppmraw/300dpi/noband) against baseline ... ERROR
Checking Es001-01.pdf (ppmraw/300dpi/banded) against baseline ... ERROR
Checking Es001-01.pdf (pkmraw/72dpi/noband) against baseline ... ERROR
Checking Es001-01.pdf (pkmraw/72dpi/banded) against baseline ... ERROR
Checking Es001-01.pdf (pkmraw/300dpi/noband) against baseline ... ERROR
Checking Es001-01.pdf (pkmraw/300dpi/banded) against baseline ... ERROR
Checking annots.pdf (pbmraw/72dpi/noband) against baseline ... ERROR
Checking annots.pdf (pbmraw/72dpi/banded) against baseline ... ERROR
Checking annots.pdf (pbmraw/300dpi/noband) against baseline ... ERROR
Checking annots.pdf (pbmraw/300dpi/banded) against baseline ... ERROR
Checking annots.pdf (pgmraw/72dpi/noband) against baseline ... ERROR
Checking annots.pdf (pgmraw/72dpi/banded) against baseline ... ERROR
Checking annots.pdf (pgmraw/300dpi/noband) against baseline ... ERROR
Checking annots.pdf (pgmraw/300dpi/banded) against baseline ... ERROR
Checking annots.pdf (ppmraw/72dpi/noband) against baseline ... ERROR
Checking annots.pdf (ppmraw/72dpi/banded) against baseline ... ERROR
Checking annots.pdf (ppmraw/300dpi/noband) against baseline ... ERROR
Checking annots.pdf (ppmraw/300dpi/banded) against baseline ... ERROR
Checking annots.pdf (pkmraw/72dpi/noband) against baseline ... ERROR
Checking annots.pdf (pkmraw/72dpi/banded) against baseline ... ERROR
Checking annots.pdf (pkmraw/300dpi/noband) against baseline ... ERROR
Checking annots.pdf (pkmraw/300dpi/banded) against baseline ... ERROR
Checking alphabet.ps (pbmraw/72dpi/noband) against baseline ... ERROR
Checking alphabet.ps (pbmraw/72dpi/banded) against baseline ... ERROR
Checking alphabet.ps (pbmraw/300dpi/noband) against baseline ... ERROR
Checking alphabet.ps (pbmraw/300dpi/banded) against baseline ... ERROR
Checking alphabet.ps (pgmraw/72dpi/noband) against baseline ... ERROR
Checking alphabet.ps (pgmraw/72dpi/banded) against baseline ... ERROR
Checking alphabet.ps (pgmraw/300dpi/noband) against baseline ... ERROR
Checking alphabet.ps (pgmraw/300dpi/banded) against baseline ... ERROR
Checking alphabet.ps (ppmraw/72dpi/noband) against baseline ... ERROR
Checking alphabet.ps (ppmraw/72dpi/banded) against baseline ... ERROR
Checking alphabet.ps (ppmraw/300dpi/noband) against baseline ... ERROR
Checking alphabet.ps (ppmraw/300dpi/banded) against baseline ... ERROR
Checking alphabet.ps (pkmraw/72dpi/noband) against baseline ... ERROR
Checking alphabet.ps (pkmraw/72dpi/banded) against baseline ... ERROR
Checking alphabet.ps (pkmraw/300dpi/noband) against baseline ... ERROR
Checking alphabet.ps (pkmraw/300dpi/banded) against baseline ... ERROR
Checking chess.ps (pbmraw/72dpi/noband) against baseline ... ERROR
Checking chess.ps (pbmraw/72dpi/banded) against baseline ... ERROR
Checking chess.ps (pbmraw/300dpi/noband) against baseline ... ERROR
Checking chess.ps (pbmraw/300dpi/banded) against baseline ... ERROR
Checking chess.ps (pgmraw/72dpi/noband) against baseline ... ERROR
Checking chess.ps (pgmraw/72dpi/banded) against baseline ... ERROR
Checking chess.ps (pgmraw/300dpi/noband) against baseline ... ERROR
Checking chess.ps (pgmraw/300dpi/banded) against baseline ... ERROR
Checking chess.ps (ppmraw/72dpi/noband) against baseline ... ERROR
Checking chess.ps (ppmraw/72dpi/banded) against baseline ... ERROR
Checking chess.ps (ppmraw/300dpi/noband) against baseline ... ERROR
Checking chess.ps (ppmraw/300dpi/banded) against baseline ... ERROR
Checking chess.ps (pkmraw/72dpi/noband) against baseline ... ERROR
Checking chess.ps (pkmraw/72dpi/banded) against baseline ... ERROR
Checking chess.ps (pkmraw/300dpi/noband) against baseline ... ERROR
Checking chess.ps (pkmraw/300dpi/banded) against baseline ... ERROR
Checking colorcir.ps (pbmraw/72dpi/noband) against baseline ... ERROR
Checking colorcir.ps (pbmraw/72dpi/banded) against baseline ... ERROR
Checking colorcir.ps (pbmraw/300dpi/noband) against baseline ... ERROR
Checking colorcir.ps (pbmraw/300dpi/banded) against baseline ... ERROR
Checking colorcir.ps (pgmraw/72dpi/noband) against baseline ... ERROR
Checking colorcir.ps (pgmraw/72dpi/banded) against baseline ... ERROR
Checking colorcir.ps (pgmraw/300dpi/noband) against baseline ... ERROR
Checking colorcir.ps (pgmraw/300dpi/banded) against baseline ... ERROR
Checking colorcir.ps (ppmraw/72dpi/noband) against baseline ... ERROR
Checking colorcir.ps (ppmraw/72dpi/banded) against baseline ... ERROR
Checking colorcir.ps (ppmraw/300dpi/noband) against baseline ... ERROR
Checking colorcir.ps (ppmraw/300dpi/banded) against baseline ... ERROR
Checking colorcir.ps (pkmraw/72dpi/noband) against baseline ... ERROR
Checking colorcir.ps (pkmraw/72dpi/banded) against baseline ... ERROR
Checking colorcir.ps (pkmraw/300dpi/noband) against baseline ... ERROR
Checking colorcir.ps (pkmraw/300dpi/banded) against baseline ... ERROR
Checking doretree.ps (pbmraw/72dpi/noband) against baseline ... ERROR
Checking doretree.ps (pbmraw/72dpi/banded) against baseline ... ERROR
Checking doretree.ps (pbmraw/300dpi/noband) against baseline ... ERROR
Checking doretree.ps (pbmraw/300dpi/banded) against baseline ... ERROR
Checking doretree.ps (pgmraw/72dpi/noband) against baseline ... ERROR
Checking doretree.ps (pgmraw/72dpi/banded) against baseline ... ERROR
Checking doretree.ps (pgmraw/300dpi/noband) against baseline ... ERROR
Checking doretree.ps (pgmraw/300dpi/banded) against baseline ... ERROR
Checking doretree.ps (ppmraw/72dpi/noband) against baseline ... ERROR
Checking doretree.ps (ppmraw/72dpi/banded) against baseline ... ERROR
Checking doretree.ps (ppmraw/300dpi/noband) against baseline ... ERROR
Checking doretree.ps (ppmraw/300dpi/banded) against baseline ... ERROR
Checking doretree.ps (pkmraw/72dpi/noband) against baseline ... ERROR
Checking doretree.ps (pkmraw/72dpi/banded) against baseline ... ERROR
Checking doretree.ps (pkmraw/300dpi/noband) against baseline ... ERROR
Checking doretree.ps (pkmraw/300dpi/banded) against baseline ... ERROR
Checking escher.ps (pbmraw/72dpi/noband) against baseline ... ERROR
Checking escher.ps (pbmraw/72dpi/banded) against baseline ... ERROR
Checking escher.ps (pbmraw/300dpi/noband) against baseline ... ERROR
Checking escher.ps (pbmraw/300dpi/banded) against baseline ... ERROR
Checking escher.ps (pgmraw/72dpi/noband) against baseline ... ERROR
Checking escher.ps (pgmraw/72dpi/banded) against baseline ... ERROR
Checking escher.ps (pgmraw/300dpi/noband) against baseline ... ERROR
Checking escher.ps (pgmraw/300dpi/banded) against baseline ... ERROR
Checking escher.ps (ppmraw/72dpi/noband) against baseline ... ERROR
Checking escher.ps (ppmraw/72dpi/banded) against baseline ... ERROR
Checking escher.ps (ppmraw/300dpi/noband) against baseline ... ERROR
Checking escher.ps (ppmraw/300dpi/banded) against baseline ... ERROR
Checking escher.ps (pkmraw/72dpi/noband) against baseline ... ERROR
Checking escher.ps (pkmraw/72dpi/banded) against baseline ... ERROR
Checking escher.ps (pkmraw/300dpi/noband) against baseline ... ERROR
Checking escher.ps (pkmraw/300dpi/banded) against baseline ... ERROR
Checking golfer.eps (pbmraw/72dpi/noband) against baseline ... ERROR
Checking golfer.eps (pbmraw/72dpi/banded) against baseline ... ERROR
Checking golfer.eps (pbmraw/300dpi/noband) against baseline ... ERROR
Checking golfer.eps (pbmraw/300dpi/banded) against baseline ... ERROR
Checking golfer.eps (pgmraw/72dpi/noband) against baseline ... ERROR
Checking golfer.eps (pgmraw/72dpi/banded) against baseline ... ERROR
Checking golfer.eps (pgmraw/300dpi/noband) against baseline ... ERROR
Checking golfer.eps (pgmraw/300dpi/banded) against baseline ... ERROR
Checking golfer.eps (ppmraw/72dpi/noband) against baseline ... ERROR
Checking golfer.eps (ppmraw/72dpi/banded) against baseline ... ERROR
Checking golfer.eps (ppmraw/300dpi/noband) against baseline ... ERROR
Checking golfer.eps (ppmraw/300dpi/banded) against baseline ... ERROR
Checking golfer.eps (pkmraw/72dpi/noband) against baseline ... ERROR
Checking golfer.eps (pkmraw/72dpi/banded) against baseline ... ERROR
Checking golfer.eps (pkmraw/300dpi/noband) against baseline ... ERROR
Checking golfer.eps (pkmraw/300dpi/banded) against baseline ... ERROR
Checking grayalph.ps (pbmraw/72dpi/noband) against baseline ... ERROR
Checking grayalph.ps (pbmraw/72dpi/banded) against baseline ... ERROR
Checking grayalph.ps (pbmraw/300dpi/noband) against baseline ... ERROR
Checking grayalph.ps (pbmraw/300dpi/banded) against baseline ... ERROR
Checking grayalph.ps (pgmraw/72dpi/noband) against baseline ... ERROR
Checking grayalph.ps (pgmraw/72dpi/banded) against baseline ... ERROR
Checking grayalph.ps (pgmraw/300dpi/noband) against baseline ... ERROR
Checking grayalph.ps (pgmraw/300dpi/banded) against baseline ... ERROR
Checking grayalph.ps (ppmraw/72dpi/noband) against baseline ... ERROR
Checking grayalph.ps (ppmraw/72dpi/banded) against baseline ... ERROR
Checking grayalph.ps (ppmraw/300dpi/noband) against baseline ... ERROR
Checking grayalph.ps (ppmraw/300dpi/banded) against baseline ... ERROR
Checking grayalph.ps (pkmraw/72dpi/noband) against baseline ... ERROR
Checking grayalph.ps (pkmraw/72dpi/banded) against baseline ... ERROR
Checking grayalph.ps (pkmraw/300dpi/noband) against baseline ... ERROR
Checking grayalph.ps (pkmraw/300dpi/banded) against baseline ... ERROR
Checking ridt91.eps (pbmraw/72dpi/noband) against baseline ... ERROR
Checking ridt91.eps (pbmraw/72dpi/banded) against baseline ... ERROR
Checking ridt91.eps (pbmraw/300dpi/noband) against baseline ... ERROR
Checking ridt91.eps (pbmraw/300dpi/banded) against baseline ... ERROR
Checking ridt91.eps (pgmraw/72dpi/noband) against baseline ... ERROR
Checking ridt91.eps (pgmraw/72dpi/banded) against baseline ... ERROR
Checking ridt91.eps (pgmraw/300dpi/noband) against baseline ... ERROR
Checking ridt91.eps (pgmraw/300dpi/banded) against baseline ... ERROR
Checking ridt91.eps (ppmraw/72dpi/noband) against baseline ... ERROR
Checking ridt91.eps (ppmraw/72dpi/banded) against baseline ... ERROR
Checking ridt91.eps (ppmraw/300dpi/noband) against baseline ... ERROR
Checking ridt91.eps (ppmraw/300dpi/banded) against baseline ... ERROR
Checking ridt91.eps (pkmraw/72dpi/noband) against baseline ... ERROR
Checking ridt91.eps (pkmraw/72dpi/banded) against baseline ... ERROR
Checking ridt91.eps (pkmraw/300dpi/noband) against baseline ... ERROR
Checking ridt91.eps (pkmraw/300dpi/banded) against baseline ... ERROR
Checking snowflak.ps (pbmraw/72dpi/noband) against baseline ... ERROR
Checking snowflak.ps (pbmraw/72dpi/banded) against baseline ... ERROR
Checking snowflak.ps (pbmraw/300dpi/noband) against baseline ... ERROR
Checking snowflak.ps (pbmraw/300dpi/banded) against baseline ... ERROR
Checking snowflak.ps (pgmraw/72dpi/noband) against baseline ... ERROR
Checking snowflak.ps (pgmraw/72dpi/banded) against baseline ... ERROR
Checking snowflak.ps (pgmraw/300dpi/noband) against baseline ... ERROR
Checking snowflak.ps (pgmraw/300dpi/banded) against baseline ... ERROR
Checking snowflak.ps (ppmraw/72dpi/noband) against baseline ... ERROR
Checking snowflak.ps (ppmraw/72dpi/banded) against baseline ... ERROR
Checking snowflak.ps (ppmraw/300dpi/noband) against baseline ... ERROR
Checking snowflak.ps (ppmraw/300dpi/banded) against baseline ... ERROR
Checking snowflak.ps (pkmraw/72dpi/noband) against baseline ... ERROR
Checking snowflak.ps (pkmraw/72dpi/banded) against baseline ... ERROR
Checking snowflak.ps (pkmraw/300dpi/noband) against baseline ... ERROR
Checking snowflak.ps (pkmraw/300dpi/banded) against baseline ... ERROR
Checking tiger.eps (pbmraw/72dpi/noband) against baseline ... ERROR
Checking tiger.eps (pbmraw/72dpi/banded) against baseline ... ERROR
Checking tiger.eps (pbmraw/300dpi/noband) against baseline ... ERROR
Checking tiger.eps (pbmraw/300dpi/banded) against baseline ... ERROR
Checking tiger.eps (pgmraw/72dpi/noband) against baseline ... ERROR
Checking tiger.eps (pgmraw/72dpi/banded) against baseline ... ERROR
Checking tiger.eps (pgmraw/300dpi/noband) against baseline ... ERROR
Checking tiger.eps (pgmraw/300dpi/banded) against baseline ... ERROR
Checking tiger.eps (ppmraw/72dpi/noband) against baseline ... ERROR
Checking tiger.eps (ppmraw/72dpi/banded) against baseline ... ERROR
Checking tiger.eps (ppmraw/300dpi/noband) against baseline ... ERROR
Checking tiger.eps (ppmraw/300dpi/banded) against baseline ... ERROR
Checking tiger.eps (pkmraw/72dpi/noband) against baseline ... ERROR
Checking tiger.eps (pkmraw/72dpi/banded) against baseline ... ERROR
Checking tiger.eps (pkmraw/300dpi/noband) against baseline ... ERROR
Checking tiger.eps (pkmraw/300dpi/banded) against baseline ... ERROR
Checking vasarely.ps (pbmraw/72dpi/noband) against baseline ... ERROR
Checking vasarely.ps (pbmraw/72dpi/banded) against baseline ... ERROR
Checking vasarely.ps (pbmraw/300dpi/noband) against baseline ... ERROR
Checking vasarely.ps (pbmraw/300dpi/banded) against baseline ... ERROR
Checking vasarely.ps (pgmraw/72dpi/noband) against baseline ... ERROR
Checking vasarely.ps (pgmraw/72dpi/banded) against baseline ... ERROR
Checking vasarely.ps (pgmraw/300dpi/noband) against baseline ... ERROR
Checking vasarely.ps (pgmraw/300dpi/banded) against baseline ... ERROR
Checking vasarely.ps (ppmraw/72dpi/noband) against baseline ... ERROR
Checking vasarely.ps (ppmraw/72dpi/banded) against baseline ... ERROR
Checking vasarely.ps (ppmraw/300dpi/noband) against baseline ... ERROR
Checking vasarely.ps (ppmraw/300dpi/banded) against baseline ... ERROR
Checking vasarely.ps (pkmraw/72dpi/noband) against baseline ... ERROR
Checking vasarely.ps (pkmraw/72dpi/banded) against baseline ... ERROR
Checking vasarely.ps (pkmraw/300dpi/noband) against baseline ... ERROR
Checking vasarely.ps (pkmraw/300dpi/banded) against baseline ... ERROR
Checking waterfal.ps (pbmraw/72dpi/noband) against baseline ... ERROR
Checking waterfal.ps (pbmraw/72dpi/banded) against baseline ... ERROR
Checking waterfal.ps (pbmraw/300dpi/noband) against baseline ... ERROR
Checking waterfal.ps (pbmraw/300dpi/banded) against baseline ... ERROR
Checking waterfal.ps (pgmraw/72dpi/noband) against baseline ... ERROR
Checking waterfal.ps (pgmraw/72dpi/banded) against baseline ... ERROR
Checking waterfal.ps (pgmraw/300dpi/noband) against baseline ... ERROR
Checking waterfal.ps (pgmraw/300dpi/banded) against baseline ... ERROR
Checking waterfal.ps (ppmraw/72dpi/noband) against baseline ... ERROR
Checking waterfal.ps (ppmraw/72dpi/banded) against baseline ... ERROR
Checking waterfal.ps (ppmraw/300dpi/noband) against baseline ... ERROR
Checking waterfal.ps (ppmraw/300dpi/banded) against baseline ... ERROR
Checking waterfal.ps (pkmraw/72dpi/noband) against baseline ... ERROR
Checking waterfal.ps (pkmraw/72dpi/banded) against baseline ... ERROR
Checking waterfal.ps (pkmraw/300dpi/noband) against baseline ... ERROR
Checking waterfal.ps (pkmraw/300dpi/banded) against baseline ... ERROR
Checking pdfwrite of 321-05.ps (ppmraw/300dpi/noband) against baseline ... DIFFER
Checking pdfwrite of 321-05.ps (pkmraw/300dpi/noband) against baseline ... DIFFER
Checking pdfwrite of Fixed_Original.pdf (ppmraw/300dpi/noband) against baseline ... DIFFER
Checking pdfwrite of QA_Inv.pdf (ppmraw/72dpi/noband) against baseline ... DIFFER
Checking pdfwrite of QA_Inv.pdf (ppmraw/300dpi/noband) against baseline ... DIFFER
Checking pdfwrite of QA_Inv.pdf (pkmraw/300dpi/noband) against baseline ... DIFFER
Checking pdfwrite of gs.anotherfailure.pdf (ppmraw/72dpi/noband) against baseline ... DIFFER
Checking pdfwrite of gs.anotherfailure.pdf (ppmraw/300dpi/noband) against baseline ... DIFFER
Checking pdfwrite of gs.anotherfailure.pdf (pkmraw/300dpi/noband) against baseline ... DIFFER
Checking pdfwrite of gs5.98-dragon.pdf (ppmraw/72dpi/noband) against baseline ... DIFFER
Checking pdfwrite of gs5.98-dragon.pdf (ppmraw/300dpi/noband) against baseline ... DIFFER
Checking pdfwrite of gs5.98-dragon.pdf (pkmraw/300dpi/noband) against baseline ... DIFFER
Checking pdfwrite of kazmir.pdf (ppmraw/72dpi/noband) against baseline ... DIFFER
Checking pdfwrite of kazmir.pdf (ppmraw/300dpi/noband) against baseline ... DIFFER
Checking pdfwrite of kazmir.pdf (pkmraw/300dpi/noband) against baseline ... DIFFER
Checking pdfwrite of knight.pdf (ppmraw/300dpi/noband) against baseline ... DIFFER
Checking pdfwrite of knight.pdf (pkmraw/300dpi/noband) against baseline ... DIFFER
Checking pdfwrite of test2.pdf (ppmraw/72dpi/noband) against baseline ... DIFFER
Checking pdfwrite of CAT_LOGO.ps (ppmraw/72dpi/noband) against baseline ... DIFFER
Checking pdfwrite of CAT_LOGO.ps (ppmraw/300dpi/noband) against baseline ... DIFFER
Checking pdfwrite of CAT_LOGO.ps (pkmraw/300dpi/noband) against baseline ... DIFFER
Checking pdfwrite of Altona-Testsuite_p2_S_x3.pdf (ppmraw/72dpi/noband) against baseline ... ERROR
Checking pdfwrite of Altona-Testsuite_p2_S_x3.pdf (ppmraw/300dpi/noband) against baseline ... ERROR
Checking pdfwrite of Altona-Testsuite_p2_S_x3.pdf (pkmraw/300dpi/noband) against baseline ... ERROR
Checking pdfwrite of Altona.Page_3.2002-09-27.pdf (ppmraw/72dpi/noband) against baseline ... ERROR
Checking pdfwrite of Altona.Page_3.2002-09-27.pdf (ppmraw/300dpi/noband) against baseline ... ERROR
Checking pdfwrite of Altona.Page_3.2002-09-27.pdf (pkmraw/300dpi/noband) against baseline ... ERROR
Checking pdfwrite of S2_Digitalproof-Forum_circles.pdf (ppmraw/72dpi/noband) against baseline ... ERROR
Checking pdfwrite of S2_Digitalproof-Forum_circles.pdf (ppmraw/300dpi/noband) against baseline ... ERROR
Checking pdfwrite of S2_Digitalproof-Forum_circles.pdf (pkmraw/300dpi/noband) against baseline ... ERROR
Checking pdfwrite of S2_Digitalproof-Forum_x3k.pdf (ppmraw/72dpi/noband) against baseline ... ERROR
Checking pdfwrite of S2_Digitalproof-Forum_x3k.pdf (ppmraw/300dpi/noband) against baseline ... ERROR
Checking pdfwrite of S2_Digitalproof-Forum_x3k.pdf (pkmraw/300dpi/noband) against baseline ... ERROR
Checking pdfwrite of Testform.v1.0.2.pdf (ppmraw/72dpi/noband) against baseline ... ERROR
Checking pdfwrite of Testform.v1.0.2.pdf (ppmraw/300dpi/noband) against baseline ... ERROR
Checking pdfwrite of Testform.v1.0.2.pdf (pkmraw/300dpi/noband) against baseline ... ERROR
Checking pdfwrite of Es001-01.pdf (ppmraw/72dpi/noband) against baseline ... ERROR
Checking pdfwrite of Es001-01.pdf (ppmraw/300dpi/noband) against baseline ... ERROR
Checking pdfwrite of Es001-01.pdf (pkmraw/300dpi/noband) against baseline ... ERROR
Checking pdfwrite of annots.pdf (ppmraw/72dpi/noband) against baseline ... ERROR
Checking pdfwrite of annots.pdf (ppmraw/300dpi/noband) against baseline ... ERROR
Checking pdfwrite of annots.pdf (pkmraw/300dpi/noband) against baseline ... ERROR
Checking pdfwrite of alphabet.ps (ppmraw/72dpi/noband) against baseline ... ERROR
Checking pdfwrite of alphabet.ps (ppmraw/300dpi/noband) against baseline ... ERROR
Checking pdfwrite of alphabet.ps (pkmraw/300dpi/noband) against baseline ... ERROR
Checking pdfwrite of chess.ps (ppmraw/72dpi/noband) against baseline ... ERROR
Checking pdfwrite of chess.ps (ppmraw/300dpi/noband) against baseline ... ERROR
Checking pdfwrite of chess.ps (pkmraw/300dpi/noband) against baseline ... ERROR
Checking pdfwrite of colorcir.ps (ppmraw/72dpi/noband) against baseline ... ERROR
Checking pdfwrite of colorcir.ps (ppmraw/300dpi/noband) against baseline ... ERROR
Checking pdfwrite of colorcir.ps (pkmraw/300dpi/noband) against baseline ... ERROR
Checking pdfwrite of doretree.ps (ppmraw/72dpi/noband) against baseline ... ERROR
Checking pdfwrite of doretree.ps (ppmraw/300dpi/noband) against baseline ... ERROR
Checking pdfwrite of doretree.ps (pkmraw/300dpi/noband) against baseline ... ERROR
Checking pdfwrite of escher.ps (ppmraw/72dpi/noband) against baseline ... ERROR
Checking pdfwrite of escher.ps (ppmraw/300dpi/noband) against baseline ... ERROR
Checking pdfwrite of escher.ps (pkmraw/300dpi/noband) against baseline ... ERROR
Checking pdfwrite of golfer.eps (ppmraw/72dpi/noband) against baseline ... ERROR
Checking pdfwrite of golfer.eps (ppmraw/300dpi/noband) against baseline ... ERROR
Checking pdfwrite of golfer.eps (pkmraw/300dpi/noband) against baseline ... ERROR
Checking pdfwrite of grayalph.ps (ppmraw/72dpi/noband) against baseline ... ERROR
Checking pdfwrite of grayalph.ps (ppmraw/300dpi/noband) against baseline ... ERROR
Checking pdfwrite of grayalph.ps (pkmraw/300dpi/noband) against baseline ... ERROR
Checking pdfwrite of ridt91.eps (ppmraw/72dpi/noband) against baseline ... ERROR
Checking pdfwrite of ridt91.eps (ppmraw/300dpi/noband) against baseline ... ERROR
Checking pdfwrite of ridt91.eps (pkmraw/300dpi/noband) against baseline ... ERROR
Checking pdfwrite of snowflak.ps (ppmraw/72dpi/noband) against baseline ... ERROR
Checking pdfwrite of snowflak.ps (ppmraw/300dpi/noband) against baseline ... ERROR
Checking pdfwrite of snowflak.ps (pkmraw/300dpi/noband) against baseline ... ERROR
Checking pdfwrite of tiger.eps (ppmraw/72dpi/noband) against baseline ... ERROR
Checking pdfwrite of tiger.eps (ppmraw/300dpi/noband) against baseline ... ERROR
Checking pdfwrite of tiger.eps (pkmraw/300dpi/noband) against baseline ... ERROR
Checking pdfwrite of vasarely.ps (ppmraw/72dpi/noband) against baseline ... ERROR
Checking pdfwrite of vasarely.ps (ppmraw/300dpi/noband) against baseline ... ERROR
Checking pdfwrite of vasarely.ps (pkmraw/300dpi/noband) against baseline ... ERROR
Checking pdfwrite of waterfal.ps (ppmraw/72dpi/noband) against baseline ... ERROR
Checking pdfwrite of waterfal.ps (ppmraw/300dpi/noband) against baseline ... ERROR
Checking pdfwrite of waterfal.ps (pkmraw/300dpi/noband) against baseline ... ERROR

======================================================================
ERROR: Checking S2_Digitalproof-Forum_circles.pdf (pbmraw/72dpi/noband) against baseline
----------------------------------------------------------------------
Traceback (most recent call last):
  File "/home/regression/regression/gstestgs.py", line 158, in runTest
    self.assertEqual(sum, gssum.get_sum(file), 'md5sum did not match baseline (' + file + ') for file: ' + self.file)
  File "/home/regression/regression/gssum.py", line 43, in get_sum
    sum = db[file]
KeyError: S2_Digitalproof-Forum_circles.pdf.pbmraw.72.0
======================================================================
ERROR: Checking S2_Digitalproof-Forum_circles.pdf (pbmraw/72dpi/banded) against baseline
----------------------------------------------------------------------
Traceback (most recent call last):
  File "/home/regression/regression/gstestgs.py", line 158, in runTest
    self.assertEqual(sum, gssum.get_sum(file), 'md5sum did not match baseline (' + file + ') for file: ' + self.file)
  File "/home/regression/regression/gssum.py", line 43, in get_sum
    sum = db[file]
KeyError: S2_Digitalproof-Forum_circles.pdf.pbmraw.72.1
======================================================================
ERROR: Checking S2_Digitalproof-Forum_circles.pdf (pbmraw/300dpi/noband) against baseline
----------------------------------------------------------------------
Traceback (most recent call last):
  File "/home/regression/regression/gstestgs.py", line 158, in runTest
    self.assertEqual(sum, gssum.get_sum(file), 'md5sum did not match baseline (' + file + ') for file: ' + self.file)
  File "/home/regression/regression/gssum.py", line 43, in get_sum
    sum = db[file]
KeyError: S2_Digitalproof-Forum_circles.pdf.pbmraw.300.0
======================================================================
ERROR: Checking S2_Digitalproof-Forum_circles.pdf (pbmraw/300dpi/banded) against baseline
----------------------------------------------------------------------
Traceback (most recent call last):
  File "/home/regression/regression/gstestgs.py", line 158, in runTest
    self.assertEqual(sum, gssum.get_sum(file), 'md5sum did not match baseline (' + file + ') for file: ' + self.file)
  File "/home/regression/regression/gssum.py", line 43, in get_sum
    sum = db[file]
KeyError: S2_Digitalproof-Forum_circles.pdf.pbmraw.300.1
======================================================================
ERROR: Checking S2_Digitalproof-Forum_circles.pdf (pgmraw/72dpi/noband) against baseline
----------------------------------------------------------------------
Traceback (most recent call last):
  File "/home/regression/regression/gstestgs.py", line 158, in runTest
    self.assertEqual(sum, gssum.get_sum(file), 'md5sum did not match baseline (' + file + ') for file: ' + self.file)
  File "/home/regression/regression/gssum.py", line 43, in get_sum
    sum = db[file]
KeyError: S2_Digitalproof-Forum_circles.pdf.pgmraw.72.0
======================================================================
ERROR: Checking S2_Digitalproof-Forum_circles.pdf (pgmraw/72dpi/banded) against baseline
----------------------------------------------------------------------
Traceback (most recent call last):
  File "/home/regression/regression/gstestgs.py", line 158, in runTest
    self.assertEqual(sum, gssum.get_sum(file), 'md5sum did not match baseline (' + file + ') for file: ' + self.file)
  File "/home/regression/regression/gssum.py", line 43, in get_sum
    sum = db[file]
KeyError: S2_Digitalproof-Forum_circles.pdf.pgmraw.72.1
======================================================================
ERROR: Checking S2_Digitalproof-Forum_circles.pdf (pgmraw/300dpi/noband) against baseline
----------------------------------------------------------------------
Traceback (most recent call last):
  File "/home/regression/regression/gstestgs.py", line 158, in runTest
    self.assertEqual(sum, gssum.get_sum(file), 'md5sum did not match baseline (' + file + ') for file: ' + self.file)
  File "/home/regression/regression/gssum.py", line 43, in get_sum
    sum = db[file]
KeyError: S2_Digitalproof-Forum_circles.pdf.pgmraw.300.0
======================================================================
ERROR: Checking S2_Digitalproof-Forum_circles.pdf (pgmraw/300dpi/banded) against baseline
----------------------------------------------------------------------
Traceback (most recent call last):
  File "/home/regression/regression/gstestgs.py", line 158, in runTest
    self.assertEqual(sum, gssum.get_sum(file), 'md5sum did not match baseline (' + file + ') for file: ' + self.file)
  File "/home/regression/regression/gssum.py", line 43, in get_sum
    sum = db[file]
KeyError: S2_Digitalproof-Forum_circles.pdf.pgmraw.300.1
======================================================================
ERROR: Checking S2_Digitalproof-Forum_circles.pdf (ppmraw/72dpi/noband) against baseline
----------------------------------------------------------------------
Traceback (most recent call last):
  File "/home/regression/regression/gstestgs.py", line 158, in runTest
    self.assertEqual(sum, gssum.get_sum(file), 'md5sum did not match baseline (' + file + ') for file: ' + self.file)
  File "/home/regression/regression/gssum.py", line 43, in get_sum
    sum = db[file]
KeyError: S2_Digitalproof-Forum_circles.pdf.ppmraw.72.0
======================================================================
ERROR: Checking S2_Digitalproof-Forum_circles.pdf (ppmraw/72dpi/banded) against baseline
----------------------------------------------------------------------
Traceback (most recent call last):
  File "/home/regression/regression/gstestgs.py", line 158, in runTest
    self.assertEqual(sum, gssum.get_sum(file), 'md5sum did not match baseline (' + file + ') for file: ' + self.file)
  File "/home/regression/regression/gssum.py", line 43, in get_sum
    sum = db[file]
KeyError: S2_Digitalproof-Forum_circles.pdf.ppmraw.72.1
======================================================================
ERROR: Checking S2_Digitalproof-Forum_circles.pdf (ppmraw/300dpi/noband) against baseline
----------------------------------------------------------------------
Traceback (most recent call last):
  File "/home/regression/regression/gstestgs.py", line 158, in runTest
    self.assertEqual(sum, gssum.get_sum(file), 'md5sum did not match baseline (' + file + ') for file: ' + self.file)
  File "/home/regression/regression/gssum.py", line 43, in get_sum
    sum = db[file]
KeyError: S2_Digitalproof-Forum_circles.pdf.ppmraw.300.0
======================================================================
ERROR: Checking S2_Digitalproof-Forum_circles.pdf (ppmraw/300dpi/banded) against baseline
----------------------------------------------------------------------
Traceback (most recent call last):
  File "/home/regression/regression/gstestgs.py", line 158, in runTest
    self.assertEqual(sum, gssum.get_sum(file), 'md5sum did not match baseline (' + file + ') for file: ' + self.file)
  File "/home/regression/regression/gssum.py", line 43, in get_sum
    sum = db[file]
KeyError: S2_Digitalproof-Forum_circles.pdf.ppmraw.300.1
======================================================================
ERROR: Checking S2_Digitalproof-Forum_circles.pdf (pkmraw/72dpi/noband) against baseline
----------------------------------------------------------------------
Traceback (most recent call last):
  File "/home/regression/regression/gstestgs.py", line 158, in runTest
    self.assertEqual(sum, gssum.get_sum(file), 'md5sum did not match baseline (' + file + ') for file: ' + self.file)
  File "/home/regression/regression/gssum.py", line 43, in get_sum
    sum = db[file]
KeyError: S2_Digitalproof-Forum_circles.pdf.pkmraw.72.0
======================================================================
ERROR: Checking S2_Digitalproof-Forum_circles.pdf (pkmraw/72dpi/banded) against baseline
----------------------------------------------------------------------
Traceback (most recent call last):
  File "/home/regression/regression/gstestgs.py", line 158, in runTest
    self.assertEqual(sum, gssum.get_sum(file), 'md5sum did not match baseline (' + file + ') for file: ' + self.file)
  File "/home/regression/regression/gssum.py", line 43, in get_sum
    sum = db[file]
KeyError: S2_Digitalproof-Forum_circles.pdf.pkmraw.72.1
======================================================================
ERROR: Checking S2_Digitalproof-Forum_circles.pdf (pkmraw/300dpi/noband) against baseline
----------------------------------------------------------------------
Traceback (most recent call last):
  File "/home/regression/regression/gstestgs.py", line 158, in runTest
    self.assertEqual(sum, gssum.get_sum(file), 'md5sum did not match baseline (' + file + ') for file: ' + self.file)
  File "/home/regression/regression/gssum.py", line 43, in get_sum
    sum = db[file]
KeyError: S2_Digitalproof-Forum_circles.pdf.pkmraw.300.0
======================================================================
ERROR: Checking S2_Digitalproof-Forum_circles.pdf (pkmraw/300dpi/banded) against baseline
----------------------------------------------------------------------
Traceback (most recent call last):
  File "/home/regression/regression/gstestgs.py", line 158, in runTest
    self.assertEqual(sum, gssum.get_sum(file), 'md5sum did not match baseline (' + file + ') for file: ' + self.file)
  File "/home/regression/regression/gssum.py", line 43, in get_sum
    sum = db[file]
KeyError: S2_Digitalproof-Forum_circles.pdf.pkmraw.300.1
======================================================================
ERROR: Checking Es001-01.pdf (pbmraw/72dpi/noband) against baseline
----------------------------------------------------------------------
Traceback (most recent call last):
  File "/home/regression/regression/gstestgs.py", line 158, in runTest
    self.assertEqual(sum, gssum.get_sum(file), 'md5sum did not match baseline (' + file + ') for file: ' + self.file)
  File "/home/regression/regression/gssum.py", line 43, in get_sum
    sum = db[file]
KeyError: Es001-01.pdf.pbmraw.72.0
======================================================================
ERROR: Checking Es001-01.pdf (pbmraw/72dpi/banded) against baseline
----------------------------------------------------------------------
Traceback (most recent call last):
  File "/home/regression/regression/gstestgs.py", line 158, in runTest
    self.assertEqual(sum, gssum.get_sum(file), 'md5sum did not match baseline (' + file + ') for file: ' + self.file)
  File "/home/regression/regression/gssum.py", line 43, in get_sum
    sum = db[file]
KeyError: Es001-01.pdf.pbmraw.72.1
======================================================================
ERROR: Checking Es001-01.pdf (pbmraw/300dpi/noband) against baseline
----------------------------------------------------------------------
Traceback (most recent call last):
  File "/home/regression/regression/gstestgs.py", line 158, in runTest
    self.assertEqual(sum, gssum.get_sum(file), 'md5sum did not match baseline (' + file + ') for file: ' + self.file)
  File "/home/regression/regression/gssum.py", line 43, in get_sum
    sum = db[file]
KeyError: Es001-01.pdf.pbmraw.300.0
======================================================================
ERROR: Checking Es001-01.pdf (pbmraw/300dpi/banded) against baseline
----------------------------------------------------------------------
Traceback (most recent call last):
  File "/home/regression/regression/gstestgs.py", line 158, in runTest
    self.assertEqual(sum, gssum.get_sum(file), 'md5sum did not match baseline (' + file + ') for file: ' + self.file)
  File "/home/regression/regression/gssum.py", line 43, in get_sum
    sum = db[file]
KeyError: Es001-01.pdf.pbmraw.300.1
======================================================================
ERROR: Checking Es001-01.pdf (pgmraw/72dpi/noband) against baseline
----------------------------------------------------------------------
Traceback (most recent call last):
  File "/home/regression/regression/gstestgs.py", line 158, in runTest
    self.assertEqual(sum, gssum.get_sum(file), 'md5sum did not match baseline (' + file + ') for file: ' + self.file)
  File "/home/regression/regression/gssum.py", line 43, in get_sum
    sum = db[file]
KeyError: Es001-01.pdf.pgmraw.72.0
======================================================================
ERROR: Checking Es001-01.pdf (pgmraw/72dpi/banded) against baseline
----------------------------------------------------------------------
Traceback (most recent call last):
  File "/home/regression/regression/gstestgs.py", line 158, in runTest
    self.assertEqual(sum, gssum.get_sum(file), 'md5sum did not match baseline (' + file + ') for file: ' + self.file)
  File "/home/regression/regression/gssum.py", line 43, in get_sum
    sum = db[file]
KeyError: Es001-01.pdf.pgmraw.72.1
======================================================================
ERROR: Checking Es001-01.pdf (pgmraw/300dpi/noband) against baseline
----------------------------------------------------------------------
Traceback (most recent call last):
  File "/home/regression/regression/gstestgs.py", line 158, in runTest
    self.assertEqual(sum, gssum.get_sum(file), 'md5sum did not match baseline (' + file + ') for file: ' + self.file)
  File "/home/regression/regression/gssum.py", line 43, in get_sum
    sum = db[file]
KeyError: Es001-01.pdf.pgmraw.300.0
======================================================================
ERROR: Checking Es001-01.pdf (pgmraw/300dpi/banded) against baseline
----------------------------------------------------------------------
Traceback (most recent call last):
  File "/home/regression/regression/gstestgs.py", line 158, in runTest
    self.assertEqual(sum, gssum.get_sum(file), 'md5sum did not match baseline (' + file + ') for file: ' + self.file)
  File "/home/regression/regression/gssum.py", line 43, in get_sum
    sum = db[file]
KeyError: Es001-01.pdf.pgmraw.300.1
======================================================================
ERROR: Checking Es001-01.pdf (ppmraw/72dpi/noband) against baseline
----------------------------------------------------------------------
Traceback (most recent call last):
  File "/home/regression/regression/gstestgs.py", line 158, in runTest
    self.assertEqual(sum, gssum.get_sum(file), 'md5sum did not match baseline (' + file + ') for file: ' + self.file)
  File "/home/regression/regression/gssum.py", line 43, in get_sum
    sum = db[file]
KeyError: Es001-01.pdf.ppmraw.72.0
======================================================================
ERROR: Checking Es001-01.pdf (ppmraw/72dpi/banded) against baseline
----------------------------------------------------------------------
Traceback (most recent call last):
  File "/home/regression/regression/gstestgs.py", line 158, in runTest
    self.assertEqual(sum, gssum.get_sum(file), 'md5sum did not match baseline (' + file + ') for file: ' + self.file)
  File "/home/regression/regression/gssum.py", line 43, in get_sum
    sum = db[file]
KeyError: Es001-01.pdf.ppmraw.72.1
======================================================================
ERROR: Checking Es001-01.pdf (ppmraw/300dpi/noband) against baseline
----------------------------------------------------------------------
Traceback (most recent call last):
  File "/home/regression/regression/gstestgs.py", line 158, in runTest
    self.assertEqual(sum, gssum.get_sum(file), 'md5sum did not match baseline (' + file + ') for file: ' + self.file)
  File "/home/regression/regression/gssum.py", line 43, in get_sum
    sum = db[file]
KeyError: Es001-01.pdf.ppmraw.300.0
======================================================================
ERROR: Checking Es001-01.pdf (ppmraw/300dpi/banded) against baseline
----------------------------------------------------------------------
Traceback (most recent call last):
  File "/home/regression/regression/gstestgs.py", line 158, in runTest
    self.assertEqual(sum, gssum.get_sum(file), 'md5sum did not match baseline (' + file + ') for file: ' + self.file)
  File "/home/regression/regression/gssum.py", line 43, in get_sum
    sum = db[file]
KeyError: Es001-01.pdf.ppmraw.300.1
======================================================================
ERROR: Checking Es001-01.pdf (pkmraw/72dpi/noband) against baseline
----------------------------------------------------------------------
Traceback (most recent call last):
  File "/home/regression/regression/gstestgs.py", line 158, in runTest
    self.assertEqual(sum, gssum.get_sum(file), 'md5sum did not match baseline (' + file + ') for file: ' + self.file)
  File "/home/regression/regression/gssum.py", line 43, in get_sum
    sum = db[file]
KeyError: Es001-01.pdf.pkmraw.72.0
======================================================================
ERROR: Checking Es001-01.pdf (pkmraw/72dpi/banded) against baseline
----------------------------------------------------------------------
Traceback (most recent call last):
  File "/home/regression/regression/gstestgs.py", line 158, in runTest
    self.assertEqual(sum, gssum.get_sum(file), 'md5sum did not match baseline (' + file + ') for file: ' + self.file)
  File "/home/regression/regression/gssum.py", line 43, in get_sum
    sum = db[file]
KeyError: Es001-01.pdf.pkmraw.72.1
======================================================================
ERROR: Checking Es001-01.pdf (pkmraw/300dpi/noband) against baseline
----------------------------------------------------------------------
Traceback (most recent call last):
  File "/home/regression/regression/gstestgs.py", line 158, in runTest
    self.assertEqual(sum, gssum.get_sum(file), 'md5sum did not match baseline (' + file + ') for file: ' + self.file)
  File "/home/regression/regression/gssum.py", line 43, in get_sum
    sum = db[file]
KeyError: Es001-01.pdf.pkmraw.300.0
======================================================================
ERROR: Checking Es001-01.pdf (pkmraw/300dpi/banded) against baseline
----------------------------------------------------------------------
Traceback (most recent call last):
  File "/home/regression/regression/gstestgs.py", line 158, in runTest
    self.assertEqual(sum, gssum.get_sum(file), 'md5sum did not match baseline (' + file + ') for file: ' + self.file)
  File "/home/regression/regression/gssum.py", line 43, in get_sum
    sum = db[file]
KeyError: Es001-01.pdf.pkmraw.300.1
======================================================================
ERROR: Checking annots.pdf (pbmraw/72dpi/noband) against baseline
----------------------------------------------------------------------
Traceback (most recent call last):
  File "/home/regression/regression/gstestgs.py", line 158, in runTest
    self.assertEqual(sum, gssum.get_sum(file), 'md5sum did not match baseline (' + file + ') for file: ' + self.file)
  File "/home/regression/regression/gssum.py", line 43, in get_sum
    sum = db[file]
KeyError: annots.pdf.pbmraw.72.0
======================================================================
ERROR: Checking annots.pdf (pbmraw/72dpi/banded) against baseline
----------------------------------------------------------------------
Traceback (most recent call last):
  File "/home/regression/regression/gstestgs.py", line 158, in runTest
    self.assertEqual(sum, gssum.get_sum(file), 'md5sum did not match baseline (' + file + ') for file: ' + self.file)
  File "/home/regression/regression/gssum.py", line 43, in get_sum
    sum = db[file]
KeyError: annots.pdf.pbmraw.72.1
======================================================================
ERROR: Checking annots.pdf (pbmraw/300dpi/noband) against baseline
----------------------------------------------------------------------
Traceback (most recent call last):
  File "/home/regression/regression/gstestgs.py", line 158, in runTest
    self.assertEqual(sum, gssum.get_sum(file), 'md5sum did not match baseline (' + file + ') for file: ' + self.file)
  File "/home/regression/regression/gssum.py", line 43, in get_sum
    sum = db[file]
KeyError: annots.pdf.pbmraw.300.0
======================================================================
ERROR: Checking annots.pdf (pbmraw/300dpi/banded) against baseline
----------------------------------------------------------------------
Traceback (most recent call last):
  File "/home/regression/regression/gstestgs.py", line 158, in runTest
    self.assertEqual(sum, gssum.get_sum(file), 'md5sum did not match baseline (' + file + ') for file: ' + self.file)
  File "/home/regression/regression/gssum.py", line 43, in get_sum
    sum = db[file]
KeyError: annots.pdf.pbmraw.300.1
======================================================================
ERROR: Checking annots.pdf (pgmraw/72dpi/noband) against baseline
----------------------------------------------------------------------
Traceback (most recent call last):
  File "/home/regression/regression/gstestgs.py", line 158, in runTest
    self.assertEqual(sum, gssum.get_sum(file), 'md5sum did not match baseline (' + file + ') for file: ' + self.file)
  File "/home/regression/regression/gssum.py", line 43, in get_sum
    sum = db[file]
KeyError: annots.pdf.pgmraw.72.0
======================================================================
ERROR: Checking annots.pdf (pgmraw/72dpi/banded) against baseline
----------------------------------------------------------------------
Traceback (most recent call last):
  File "/home/regression/regression/gstestgs.py", line 158, in runTest
    self.assertEqual(sum, gssum.get_sum(file), 'md5sum did not match baseline (' + file + ') for file: ' + self.file)
  File "/home/regression/regression/gssum.py", line 43, in get_sum
    sum = db[file]
KeyError: annots.pdf.pgmraw.72.1
======================================================================
ERROR: Checking annots.pdf (pgmraw/300dpi/noband) against baseline
----------------------------------------------------------------------
Traceback (most recent call last):
  File "/home/regression/regression/gstestgs.py", line 158, in runTest
    self.assertEqual(sum, gssum.get_sum(file), 'md5sum did not match baseline (' + file + ') for file: ' + self.file)
  File "/home/regression/regression/gssum.py", line 43, in get_sum
    sum = db[file]
KeyError: annots.pdf.pgmraw.300.0
======================================================================
ERROR: Checking annots.pdf (pgmraw/300dpi/banded) against baseline
----------------------------------------------------------------------
Traceback (most recent call last):
  File "/home/regression/regression/gstestgs.py", line 158, in runTest
    self.assertEqual(sum, gssum.get_sum(file), 'md5sum did not match baseline (' + file + ') for file: ' + self.file)
  File "/home/regression/regression/gssum.py", line 43, in get_sum
    sum = db[file]
KeyError: annots.pdf.pgmraw.300.1
======================================================================
ERROR: Checking annots.pdf (ppmraw/72dpi/noband) against baseline
----------------------------------------------------------------------
Traceback (most recent call last):
  File "/home/regression/regression/gstestgs.py", line 158, in runTest
    self.assertEqual(sum, gssum.get_sum(file), 'md5sum did not match baseline (' + file + ') for file: ' + self.file)
  File "/home/regression/regression/gssum.py", line 43, in get_sum
    sum = db[file]
KeyError: annots.pdf.ppmraw.72.0
======================================================================
ERROR: Checking annots.pdf (ppmraw/72dpi/banded) against baseline
----------------------------------------------------------------------
Traceback (most recent call last):
  File "/home/regression/regression/gstestgs.py", line 158, in runTest
    self.assertEqual(sum, gssum.get_sum(file), 'md5sum did not match baseline (' + file + ') for file: ' + self.file)
  File "/home/regression/regression/gssum.py", line 43, in get_sum
    sum = db[file]
KeyError: annots.pdf.ppmraw.72.1
======================================================================
ERROR: Checking annots.pdf (ppmraw/300dpi/noband) against baseline
----------------------------------------------------------------------
Traceback (most recent call last):
  File "/home/regression/regression/gstestgs.py", line 158, in runTest
    self.assertEqual(sum, gssum.get_sum(file), 'md5sum did not match baseline (' + file + ') for file: ' + self.file)
  File "/home/regression/regression/gssum.py", line 43, in get_sum
    sum = db[file]
KeyError: annots.pdf.ppmraw.300.0
======================================================================
ERROR: Checking annots.pdf (ppmraw/300dpi/banded) against baseline
----------------------------------------------------------------------
Traceback (most recent call last):
  File "/home/regression/regression/gstestgs.py", line 158, in runTest
    self.assertEqual(sum, gssum.get_sum(file), 'md5sum did not match baseline (' + file + ') for file: ' + self.file)
  File "/home/regression/regression/gssum.py", line 43, in get_sum
    sum = db[file]
KeyError: annots.pdf.ppmraw.300.1
======================================================================
ERROR: Checking annots.pdf (pkmraw/72dpi/noband) against baseline
----------------------------------------------------------------------
Traceback (most recent call last):
  File "/home/regression/regression/gstestgs.py", line 158, in runTest
    self.assertEqual(sum, gssum.get_sum(file), 'md5sum did not match baseline (' + file + ') for file: ' + self.file)
  File "/home/regression/regression/gssum.py", line 43, in get_sum
    sum = db[file]
KeyError: annots.pdf.pkmraw.72.0
======================================================================
ERROR: Checking annots.pdf (pkmraw/72dpi/banded) against baseline
----------------------------------------------------------------------
Traceback (most recent call last):
  File "/home/regression/regression/gstestgs.py", line 158, in runTest
    self.assertEqual(sum, gssum.get_sum(file), 'md5sum did not match baseline (' + file + ') for file: ' + self.file)
  File "/home/regression/regression/gssum.py", line 43, in get_sum
    sum = db[file]
KeyError: annots.pdf.pkmraw.72.1
======================================================================
ERROR: Checking annots.pdf (pkmraw/300dpi/noband) against baseline
----------------------------------------------------------------------
Traceback (most recent call last):
  File "/home/regression/regression/gstestgs.py", line 158, in runTest
    self.assertEqual(sum, gssum.get_sum(file), 'md5sum did not match baseline (' + file + ') for file: ' + self.file)
  File "/home/regression/regression/gssum.py", line 43, in get_sum
    sum = db[file]
KeyError: annots.pdf.pkmraw.300.0
======================================================================
ERROR: Checking annots.pdf (pkmraw/300dpi/banded) against baseline
----------------------------------------------------------------------
Traceback (most recent call last):
  File "/home/regression/regression/gstestgs.py", line 158, in runTest
    self.assertEqual(sum, gssum.get_sum(file), 'md5sum did not match baseline (' + file + ') for file: ' + self.file)
  File "/home/regression/regression/gssum.py", line 43, in get_sum
    sum = db[file]
KeyError: annots.pdf.pkmraw.300.1
======================================================================
ERROR: Checking alphabet.ps (pbmraw/72dpi/noband) against baseline
----------------------------------------------------------------------
Traceback (most recent call last):
  File "/home/regression/regression/gstestgs.py", line 158, in runTest
    self.assertEqual(sum, gssum.get_sum(file), 'md5sum did not match baseline (' + file + ') for file: ' + self.file)
  File "/home/regression/regression/gssum.py", line 43, in get_sum
    sum = db[file]
KeyError: alphabet.ps.pbmraw.72.0
======================================================================
ERROR: Checking alphabet.ps (pbmraw/72dpi/banded) against baseline
----------------------------------------------------------------------
Traceback (most recent call last):
  File "/home/regression/regression/gstestgs.py", line 158, in runTest
    self.assertEqual(sum, gssum.get_sum(file), 'md5sum did not match baseline (' + file + ') for file: ' + self.file)
  File "/home/regression/regression/gssum.py", line 43, in get_sum
    sum = db[file]
KeyError: alphabet.ps.pbmraw.72.1
======================================================================
ERROR: Checking alphabet.ps (pbmraw/300dpi/noband) against baseline
----------------------------------------------------------------------
Traceback (most recent call last):
  File "/home/regression/regression/gstestgs.py", line 158, in runTest
    self.assertEqual(sum, gssum.get_sum(file), 'md5sum did not match baseline (' + file + ') for file: ' + self.file)
  File "/home/regression/regression/gssum.py", line 43, in get_sum
    sum = db[file]
KeyError: alphabet.ps.pbmraw.300.0
======================================================================
ERROR: Checking alphabet.ps (pbmraw/300dpi/banded) against baseline
----------------------------------------------------------------------
Traceback (most recent call last):
  File "/home/regression/regression/gstestgs.py", line 158, in runTest
    self.assertEqual(sum, gssum.get_sum(file), 'md5sum did not match baseline (' + file + ') for file: ' + self.file)
  File "/home/regression/regression/gssum.py", line 43, in get_sum
    sum = db[file]
KeyError: alphabet.ps.pbmraw.300.1
======================================================================
ERROR: Checking alphabet.ps (pgmraw/72dpi/noband) against baseline
----------------------------------------------------------------------
Traceback (most recent call last):
  File "/home/regression/regression/gstestgs.py", line 158, in runTest
    self.assertEqual(sum, gssum.get_sum(file), 'md5sum did not match baseline (' + file + ') for file: ' + self.file)
  File "/home/regression/regression/gssum.py", line 43, in get_sum
    sum = db[file]
KeyError: alphabet.ps.pgmraw.72.0
======================================================================
ERROR: Checking alphabet.ps (pgmraw/72dpi/banded) against baseline
----------------------------------------------------------------------
Traceback (most recent call last):
  File "/home/regression/regression/gstestgs.py", line 158, in runTest
    self.assertEqual(sum, gssum.get_sum(file), 'md5sum did not match baseline (' + file + ') for file: ' + self.file)
  File "/home/regression/regression/gssum.py", line 43, in get_sum
    sum = db[file]
KeyError: alphabet.ps.pgmraw.72.1
======================================================================
ERROR: Checking alphabet.ps (pgmraw/300dpi/noband) against baseline
----------------------------------------------------------------------
Traceback (most recent call last):
  File "/home/regression/regression/gstestgs.py", line 158, in runTest
    self.assertEqual(sum, gssum.get_sum(file), 'md5sum did not match baseline (' + file + ') for file: ' + self.file)
  File "/home/regression/regression/gssum.py", line 43, in get_sum
    sum = db[file]
KeyError: alphabet.ps.pgmraw.300.0
======================================================================
ERROR: Checking alphabet.ps (pgmraw/300dpi/banded) against baseline
----------------------------------------------------------------------
Traceback (most recent call last):
  File "/home/regression/regression/gstestgs.py", line 158, in runTest
    self.assertEqual(sum, gssum.get_sum(file), 'md5sum did not match baseline (' + file + ') for file: ' + self.file)
  File "/home/regression/regression/gssum.py", line 43, in get_sum
    sum = db[file]
KeyError: alphabet.ps.pgmraw.300.1
======================================================================
ERROR: Checking alphabet.ps (ppmraw/72dpi/noband) against baseline
----------------------------------------------------------------------
Traceback (most recent call last):
  File "/home/regression/regression/gstestgs.py", line 158, in runTest
    self.assertEqual(sum, gssum.get_sum(file), 'md5sum did not match baseline (' + file + ') for file: ' + self.file)
  File "/home/regression/regression/gssum.py", line 43, in get_sum
    sum = db[file]
KeyError: alphabet.ps.ppmraw.72.0
======================================================================
ERROR: Checking alphabet.ps (ppmraw/72dpi/banded) against baseline
----------------------------------------------------------------------
Traceback (most recent call last):
  File "/home/regression/regression/gstestgs.py", line 158, in runTest
    self.assertEqual(sum, gssum.get_sum(file), 'md5sum did not match baseline (' + file + ') for file: ' + self.file)
  File "/home/regression/regression/gssum.py", line 43, in get_sum
    sum = db[file]
KeyError: alphabet.ps.ppmraw.72.1
======================================================================
ERROR: Checking alphabet.ps (ppmraw/300dpi/noband) against baseline
----------------------------------------------------------------------
Traceback (most recent call last):
  File "/home/regression/regression/gstestgs.py", line 158, in runTest
    self.assertEqual(sum, gssum.get_sum(file), 'md5sum did not match baseline (' + file + ') for file: ' + self.file)
  File "/home/regression/regression/gssum.py", line 43, in get_sum
    sum = db[file]
KeyError: alphabet.ps.ppmraw.300.0
======================================================================
ERROR: Checking alphabet.ps (ppmraw/300dpi/banded) against baseline
----------------------------------------------------------------------
Traceback (most recent call last):
  File "/home/regression/regression/gstestgs.py", line 158, in runTest
    self.assertEqual(sum, gssum.get_sum(file), 'md5sum did not match baseline (' + file + ') for file: ' + self.file)
  File "/home/regression/regression/gssum.py", line 43, in get_sum
    sum = db[file]
KeyError: alphabet.ps.ppmraw.300.1
======================================================================
ERROR: Checking alphabet.ps (pkmraw/72dpi/noband) against baseline
----------------------------------------------------------------------
Traceback (most recent call last):
  File "/home/regression/regression/gstestgs.py", line 158, in runTest
    self.assertEqual(sum, gssum.get_sum(file), 'md5sum did not match baseline (' + file + ') for file: ' + self.file)
  File "/home/regression/regression/gssum.py", line 43, in get_sum
    sum = db[file]
KeyError: alphabet.ps.pkmraw.72.0
======================================================================
ERROR: Checking alphabet.ps (pkmraw/72dpi/banded) against baseline
----------------------------------------------------------------------
Traceback (most recent call last):
  File "/home/regression/regression/gstestgs.py", line 158, in runTest
    self.assertEqual(sum, gssum.get_sum(file), 'md5sum did not match baseline (' + file + ') for file: ' + self.file)
  File "/home/regression/regression/gssum.py", line 43, in get_sum
    sum = db[file]
KeyError: alphabet.ps.pkmraw.72.1
======================================================================
ERROR: Checking alphabet.ps (pkmraw/300dpi/noband) against baseline
----------------------------------------------------------------------
Traceback (most recent call last):
  File "/home/regression/regression/gstestgs.py", line 158, in runTest
    self.assertEqual(sum, gssum.get_sum(file), 'md5sum did not match baseline (' + file + ') for file: ' + self.file)
  File "/home/regression/regression/gssum.py", line 43, in get_sum
    sum = db[file]
KeyError: alphabet.ps.pkmraw.300.0
======================================================================
ERROR: Checking alphabet.ps (pkmraw/300dpi/banded) against baseline
----------------------------------------------------------------------
Traceback (most recent call last):
  File "/home/regression/regression/gstestgs.py", line 158, in runTest
    self.assertEqual(sum, gssum.get_sum(file), 'md5sum did not match baseline (' + file + ') for file: ' + self.file)
  File "/home/regression/regression/gssum.py", line 43, in get_sum
    sum = db[file]
KeyError: alphabet.ps.pkmraw.300.1
======================================================================
ERROR: Checking chess.ps (pbmraw/72dpi/noband) against baseline
----------------------------------------------------------------------
Traceback (most recent call last):
  File "/home/regression/regression/gstestgs.py", line 158, in runTest
    self.assertEqual(sum, gssum.get_sum(file), 'md5sum did not match baseline (' + file + ') for file: ' + self.file)
  File "/home/regression/regression/gssum.py", line 43, in get_sum
    sum = db[file]
KeyError: chess.ps.pbmraw.72.0
======================================================================
ERROR: Checking chess.ps (pbmraw/72dpi/banded) against baseline
----------------------------------------------------------------------
Traceback (most recent call last):
  File "/home/regression/regression/gstestgs.py", line 158, in runTest
    self.assertEqual(sum, gssum.get_sum(file), 'md5sum did not match baseline (' + file + ') for file: ' + self.file)
  File "/home/regression/regression/gssum.py", line 43, in get_sum
    sum = db[file]
KeyError: chess.ps.pbmraw.72.1
======================================================================
ERROR: Checking chess.ps (pbmraw/300dpi/noband) against baseline
----------------------------------------------------------------------
Traceback (most recent call last):
  File "/home/regression/regression/gstestgs.py", line 158, in runTest
    self.assertEqual(sum, gssum.get_sum(file), 'md5sum did not match baseline (' + file + ') for file: ' + self.file)
  File "/home/regression/regression/gssum.py", line 43, in get_sum
    sum = db[file]
KeyError: chess.ps.pbmraw.300.0
======================================================================
ERROR: Checking chess.ps (pbmraw/300dpi/banded) against baseline
----------------------------------------------------------------------
Traceback (most recent call last):
  File "/home/regression/regression/gstestgs.py", line 158, in runTest
    self.assertEqual(sum, gssum.get_sum(file), 'md5sum did not match baseline (' + file + ') for file: ' + self.file)
  File "/home/regression/regression/gssum.py", line 43, in get_sum
    sum = db[file]
KeyError: chess.ps.pbmraw.300.1
======================================================================
ERROR: Checking chess.ps (pgmraw/72dpi/noband) against baseline
----------------------------------------------------------------------
Traceback (most recent call last):
  File "/home/regression/regression/gstestgs.py", line 158, in runTest
    self.assertEqual(sum, gssum.get_sum(file), 'md5sum did not match baseline (' + file + ') for file: ' + self.file)
  File "/home/regression/regression/gssum.py", line 43, in get_sum
    sum = db[file]
KeyError: chess.ps.pgmraw.72.0
======================================================================
ERROR: Checking chess.ps (pgmraw/72dpi/banded) against baseline
----------------------------------------------------------------------
Traceback (most recent call last):
  File "/home/regression/regression/gstestgs.py", line 158, in runTest
    self.assertEqual(sum, gssum.get_sum(file), 'md5sum did not match baseline (' + file + ') for file: ' + self.file)
  File "/home/regression/regression/gssum.py", line 43, in get_sum
    sum = db[file]
KeyError: chess.ps.pgmraw.72.1
======================================================================
ERROR: Checking chess.ps (pgmraw/300dpi/noband) against baseline
----------------------------------------------------------------------
Traceback (most recent call last):
  File "/home/regression/regression/gstestgs.py", line 158, in runTest
    self.assertEqual(sum, gssum.get_sum(file), 'md5sum did not match baseline (' + file + ') for file: ' + self.file)
  File "/home/regression/regression/gssum.py", line 43, in get_sum
    sum = db[file]
KeyError: chess.ps.pgmraw.300.0
======================================================================
ERROR: Checking chess.ps (pgmraw/300dpi/banded) against baseline
----------------------------------------------------------------------
Traceback (most recent call last):
  File "/home/regression/regression/gstestgs.py", line 158, in runTest
    self.assertEqual(sum, gssum.get_sum(file), 'md5sum did not match baseline (' + file + ') for file: ' + self.file)
  File "/home/regression/regression/gssum.py", line 43, in get_sum
    sum = db[file]
KeyError: chess.ps.pgmraw.300.1
======================================================================
ERROR: Checking chess.ps (ppmraw/72dpi/noband) against baseline
----------------------------------------------------------------------
Traceback (most recent call last):
  File "/home/regression/regression/gstestgs.py", line 158, in runTest
    self.assertEqual(sum, gssum.get_sum(file), 'md5sum did not match baseline (' + file + ') for file: ' + self.file)
  File "/home/regression/regression/gssum.py", line 43, in get_sum
    sum = db[file]
KeyError: chess.ps.ppmraw.72.0
======================================================================
ERROR: Checking chess.ps (ppmraw/72dpi/banded) against baseline
----------------------------------------------------------------------
Traceback (most recent call last):
  File "/home/regression/regression/gstestgs.py", line 158, in runTest
    self.assertEqual(sum, gssum.get_sum(file), 'md5sum did not match baseline (' + file + ') for file: ' + self.file)
  File "/home/regression/regression/gssum.py", line 43, in get_sum
    sum = db[file]
KeyError: chess.ps.ppmraw.72.1
======================================================================
ERROR: Checking chess.ps (ppmraw/300dpi/noband) against baseline
----------------------------------------------------------------------
Traceback (most recent call last):
  File "/home/regression/regression/gstestgs.py", line 158, in runTest
    self.assertEqual(sum, gssum.get_sum(file), 'md5sum did not match baseline (' + file + ') for file: ' + self.file)
  File "/home/regression/regression/gssum.py", line 43, in get_sum
    sum = db[file]
KeyError: chess.ps.ppmraw.300.0
======================================================================
ERROR: Checking chess.ps (ppmraw/300dpi/banded) against baseline
----------------------------------------------------------------------
Traceback (most recent call last):
  File "/home/regression/regression/gstestgs.py", line 158, in runTest
    self.assertEqual(sum, gssum.get_sum(file), 'md5sum did not match baseline (' + file + ') for file: ' + self.file)
  File "/home/regression/regression/gssum.py", line 43, in get_sum
    sum = db[file]
KeyError: chess.ps.ppmraw.300.1
======================================================================
ERROR: Checking chess.ps (pkmraw/72dpi/noband) against baseline
----------------------------------------------------------------------
Traceback (most recent call last):
  File "/home/regression/regression/gstestgs.py", line 158, in runTest
    self.assertEqual(sum, gssum.get_sum(file), 'md5sum did not match baseline (' + file + ') for file: ' + self.file)
  File "/home/regression/regression/gssum.py", line 43, in get_sum
    sum = db[file]
KeyError: chess.ps.pkmraw.72.0
======================================================================
ERROR: Checking chess.ps (pkmraw/72dpi/banded) against baseline
----------------------------------------------------------------------
Traceback (most recent call last):
  File "/home/regression/regression/gstestgs.py", line 158, in runTest
    self.assertEqual(sum, gssum.get_sum(file), 'md5sum did not match baseline (' + file + ') for file: ' + self.file)
  File "/home/regression/regression/gssum.py", line 43, in get_sum
    sum = db[file]
KeyError: chess.ps.pkmraw.72.1
======================================================================
ERROR: Checking chess.ps (pkmraw/300dpi/noband) against baseline
----------------------------------------------------------------------
Traceback (most recent call last):
  File "/home/regression/regression/gstestgs.py", line 158, in runTest
    self.assertEqual(sum, gssum.get_sum(file), 'md5sum did not match baseline (' + file + ') for file: ' + self.file)
  File "/home/regression/regression/gssum.py", line 43, in get_sum
    sum = db[file]
KeyError: chess.ps.pkmraw.300.0
======================================================================
ERROR: Checking chess.ps (pkmraw/300dpi/banded) against baseline
----------------------------------------------------------------------
Traceback (most recent call last):
  File "/home/regression/regression/gstestgs.py", line 158, in runTest
    self.assertEqual(sum, gssum.get_sum(file), 'md5sum did not match baseline (' + file + ') for file: ' + self.file)
  File "/home/regression/regression/gssum.py", line 43, in get_sum
    sum = db[file]
KeyError: chess.ps.pkmraw.300.1
======================================================================
ERROR: Checking colorcir.ps (pbmraw/72dpi/noband) against baseline
----------------------------------------------------------------------
Traceback (most recent call last):
  File "/home/regression/regression/gstestgs.py", line 158, in runTest
    self.assertEqual(sum, gssum.get_sum(file), 'md5sum did not match baseline (' + file + ') for file: ' + self.file)
  File "/home/regression/regression/gssum.py", line 43, in get_sum
    sum = db[file]
KeyError: colorcir.ps.pbmraw.72.0
======================================================================
ERROR: Checking colorcir.ps (pbmraw/72dpi/banded) against baseline
----------------------------------------------------------------------
Traceback (most recent call last):
  File "/home/regression/regression/gstestgs.py", line 158, in runTest
    self.assertEqual(sum, gssum.get_sum(file), 'md5sum did not match baseline (' + file + ') for file: ' + self.file)
  File "/home/regression/regression/gssum.py", line 43, in get_sum
    sum = db[file]
KeyError: colorcir.ps.pbmraw.72.1
======================================================================
ERROR: Checking colorcir.ps (pbmraw/300dpi/noband) against baseline
----------------------------------------------------------------------
Traceback (most recent call last):
  File "/home/regression/regression/gstestgs.py", line 158, in runTest
    self.assertEqual(sum, gssum.get_sum(file), 'md5sum did not match baseline (' + file + ') for file: ' + self.file)
  File "/home/regression/regression/gssum.py", line 43, in get_sum
    sum = db[file]
KeyError: colorcir.ps.pbmraw.300.0
======================================================================
ERROR: Checking colorcir.ps (pbmraw/300dpi/banded) against baseline
----------------------------------------------------------------------
Traceback (most recent call last):
  File "/home/regression/regression/gstestgs.py", line 158, in runTest
    self.assertEqual(sum, gssum.get_sum(file), 'md5sum did not match baseline (' + file + ') for file: ' + self.file)
  File "/home/regression/regression/gssum.py", line 43, in get_sum
    sum = db[file]
KeyError: colorcir.ps.pbmraw.300.1
======================================================================
ERROR: Checking colorcir.ps (pgmraw/72dpi/noband) against baseline
----------------------------------------------------------------------
Traceback (most recent call last):
  File "/home/regression/regression/gstestgs.py", line 158, in runTest
    self.assertEqual(sum, gssum.get_sum(file), 'md5sum did not match baseline (' + file + ') for file: ' + self.file)
  File "/home/regression/regression/gssum.py", line 43, in get_sum
    sum = db[file]
KeyError: colorcir.ps.pgmraw.72.0
======================================================================
ERROR: Checking colorcir.ps (pgmraw/72dpi/banded) against baseline
----------------------------------------------------------------------
Traceback (most recent call last):
  File "/home/regression/regression/gstestgs.py", line 158, in runTest
    self.assertEqual(sum, gssum.get_sum(file), 'md5sum did not match baseline (' + file + ') for file: ' + self.file)
  File "/home/regression/regression/gssum.py", line 43, in get_sum
    sum = db[file]
KeyError: colorcir.ps.pgmraw.72.1
======================================================================
ERROR: Checking colorcir.ps (pgmraw/300dpi/noband) against baseline
----------------------------------------------------------------------
Traceback (most recent call last):
  File "/home/regression/regression/gstestgs.py", line 158, in runTest
    self.assertEqual(sum, gssum.get_sum(file), 'md5sum did not match baseline (' + file + ') for file: ' + self.file)
  File "/home/regression/regression/gssum.py", line 43, in get_sum
    sum = db[file]
KeyError: colorcir.ps.pgmraw.300.0
======================================================================
ERROR: Checking colorcir.ps (pgmraw/300dpi/banded) against baseline
----------------------------------------------------------------------
Traceback (most recent call last):
  File "/home/regression/regression/gstestgs.py", line 158, in runTest
    self.assertEqual(sum, gssum.get_sum(file), 'md5sum did not match baseline (' + file + ') for file: ' + self.file)
  File "/home/regression/regression/gssum.py", line 43, in get_sum
    sum = db[file]
KeyError: colorcir.ps.pgmraw.300.1
======================================================================
ERROR: Checking colorcir.ps (ppmraw/72dpi/noband) against baseline
----------------------------------------------------------------------
Traceback (most recent call last):
  File "/home/regression/regression/gstestgs.py", line 158, in runTest
    self.assertEqual(sum, gssum.get_sum(file), 'md5sum did not match baseline (' + file + ') for file: ' + self.file)
  File "/home/regression/regression/gssum.py", line 43, in get_sum
    sum = db[file]
KeyError: colorcir.ps.ppmraw.72.0
======================================================================
ERROR: Checking colorcir.ps (ppmraw/72dpi/banded) against baseline
----------------------------------------------------------------------
Traceback (most recent call last):
  File "/home/regression/regression/gstestgs.py", line 158, in runTest
    self.assertEqual(sum, gssum.get_sum(file), 'md5sum did not match baseline (' + file + ') for file: ' + self.file)
  File "/home/regression/regression/gssum.py", line 43, in get_sum
    sum = db[file]
KeyError: colorcir.ps.ppmraw.72.1
======================================================================
ERROR: Checking colorcir.ps (ppmraw/300dpi/noband) against baseline
----------------------------------------------------------------------
Traceback (most recent call last):
  File "/home/regression/regression/gstestgs.py", line 158, in runTest
    self.assertEqual(sum, gssum.get_sum(file), 'md5sum did not match baseline (' + file + ') for file: ' + self.file)
  File "/home/regression/regression/gssum.py", line 43, in get_sum
    sum = db[file]
KeyError: colorcir.ps.ppmraw.300.0
======================================================================
ERROR: Checking colorcir.ps (ppmraw/300dpi/banded) against baseline
----------------------------------------------------------------------
Traceback (most recent call last):
  File "/home/regression/regression/gstestgs.py", line 158, in runTest
    self.assertEqual(sum, gssum.get_sum(file), 'md5sum did not match baseline (' + file + ') for file: ' + self.file)
  File "/home/regression/regression/gssum.py", line 43, in get_sum
    sum = db[file]
KeyError: colorcir.ps.ppmraw.300.1
======================================================================
ERROR: Checking colorcir.ps (pkmraw/72dpi/noband) against baseline
----------------------------------------------------------------------
Traceback (most recent call last):
  File "/home/regression/regression/gstestgs.py", line 158, in runTest
    self.assertEqual(sum, gssum.get_sum(file), 'md5sum did not match baseline (' + file + ') for file: ' + self.file)
  File "/home/regression/regression/gssum.py", line 43, in get_sum
    sum = db[file]
KeyError: colorcir.ps.pkmraw.72.0
======================================================================
ERROR: Checking colorcir.ps (pkmraw/72dpi/banded) against baseline
----------------------------------------------------------------------
Traceback (most recent call last):
  File "/home/regression/regression/gstestgs.py", line 158, in runTest
    self.assertEqual(sum, gssum.get_sum(file), 'md5sum did not match baseline (' + file + ') for file: ' + self.file)
  File "/home/regression/regression/gssum.py", line 43, in get_sum
    sum = db[file]
KeyError: colorcir.ps.pkmraw.72.1
======================================================================
ERROR: Checking colorcir.ps (pkmraw/300dpi/noband) against baseline
----------------------------------------------------------------------
Traceback (most recent call last):
  File "/home/regression/regression/gstestgs.py", line 158, in runTest
    self.assertEqual(sum, gssum.get_sum(file), 'md5sum did not match baseline (' + file + ') for file: ' + self.file)
  File "/home/regression/regression/gssum.py", line 43, in get_sum
    sum = db[file]
KeyError: colorcir.ps.pkmraw.300.0
======================================================================
ERROR: Checking colorcir.ps (pkmraw/300dpi/banded) against baseline
----------------------------------------------------------------------
Traceback (most recent call last):
  File "/home/regression/regression/gstestgs.py", line 158, in runTest
    self.assertEqual(sum, gssum.get_sum(file), 'md5sum did not match baseline (' + file + ') for file: ' + self.file)
  File "/home/regression/regression/gssum.py", line 43, in get_sum
    sum = db[file]
KeyError: colorcir.ps.pkmraw.300.1
======================================================================
ERROR: Checking doretree.ps (pbmraw/72dpi/noband) against baseline
----------------------------------------------------------------------
Traceback (most recent call last):
  File "/home/regression/regression/gstestgs.py", line 158, in runTest
    self.assertEqual(sum, gssum.get_sum(file), 'md5sum did not match baseline (' + file + ') for file: ' + self.file)
  File "/home/regression/regression/gssum.py", line 43, in get_sum
    sum = db[file]
KeyError: doretree.ps.pbmraw.72.0
======================================================================
ERROR: Checking doretree.ps (pbmraw/72dpi/banded) against baseline
----------------------------------------------------------------------
Traceback (most recent call last):
  File "/home/regression/regression/gstestgs.py", line 158, in runTest
    self.assertEqual(sum, gssum.get_sum(file), 'md5sum did not match baseline (' + file + ') for file: ' + self.file)
  File "/home/regression/regression/gssum.py", line 43, in get_sum
    sum = db[file]
KeyError: doretree.ps.pbmraw.72.1
======================================================================
ERROR: Checking doretree.ps (pbmraw/300dpi/noband) against baseline
----------------------------------------------------------------------
Traceback (most recent call last):
  File "/home/regression/regression/gstestgs.py", line 158, in runTest
    self.assertEqual(sum, gssum.get_sum(file), 'md5sum did not match baseline (' + file + ') for file: ' + self.file)
  File "/home/regression/regression/gssum.py", line 43, in get_sum
    sum = db[file]
KeyError: doretree.ps.pbmraw.300.0
======================================================================
ERROR: Checking doretree.ps (pbmraw/300dpi/banded) against baseline
----------------------------------------------------------------------
Traceback (most recent call last):
  File "/home/regression/regression/gstestgs.py", line 158, in runTest
    self.assertEqual(sum, gssum.get_sum(file), 'md5sum did not match baseline (' + file + ') for file: ' + self.file)
  File "/home/regression/regression/gssum.py", line 43, in get_sum
    sum = db[file]
KeyError: doretree.ps.pbmraw.300.1
======================================================================
ERROR: Checking doretree.ps (pgmraw/72dpi/noband) against baseline
----------------------------------------------------------------------
Traceback (most recent call last):
  File "/home/regression/regression/gstestgs.py", line 158, in runTest
    self.assertEqual(sum, gssum.get_sum(file), 'md5sum did not match baseline (' + file + ') for file: ' + self.file)
  File "/home/regression/regression/gssum.py", line 43, in get_sum
    sum = db[file]
KeyError: doretree.ps.pgmraw.72.0
======================================================================
ERROR: Checking doretree.ps (pgmraw/72dpi/banded) against baseline
----------------------------------------------------------------------
Traceback (most recent call last):
  File "/home/regression/regression/gstestgs.py", line 158, in runTest
    self.assertEqual(sum, gssum.get_sum(file), 'md5sum did not match baseline (' + file + ') for file: ' + self.file)
  File "/home/regression/regression/gssum.py", line 43, in get_sum
    sum = db[file]
KeyError: doretree.ps.pgmraw.72.1
======================================================================
ERROR: Checking doretree.ps (pgmraw/300dpi/noband) against baseline
----------------------------------------------------------------------
Traceback (most recent call last):
  File "/home/regression/regression/gstestgs.py", line 158, in runTest
    self.assertEqual(sum, gssum.get_sum(file), 'md5sum did not match baseline (' + file + ') for file: ' + self.file)
  File "/home/regression/regression/gssum.py", line 43, in get_sum
    sum = db[file]
KeyError: doretree.ps.pgmraw.300.0
======================================================================
ERROR: Checking doretree.ps (pgmraw/300dpi/banded) against baseline
----------------------------------------------------------------------
Traceback (most recent call last):
  File "/home/regression/regression/gstestgs.py", line 158, in runTest
    self.assertEqual(sum, gssum.get_sum(file), 'md5sum did not match baseline (' + file + ') for file: ' + self.file)
  File "/home/regression/regression/gssum.py", line 43, in get_sum
    sum = db[file]
KeyError: doretree.ps.pgmraw.300.1
======================================================================
ERROR: Checking doretree.ps (ppmraw/72dpi/noband) against baseline
----------------------------------------------------------------------
Traceback (most recent call last):
  File "/home/regression/regression/gstestgs.py", line 158, in runTest
    self.assertEqual(sum, gssum.get_sum(file), 'md5sum did not match baseline (' + file + ') for file: ' + self.file)
  File "/home/regression/regression/gssum.py", line 43, in get_sum
    sum = db[file]
KeyError: doretree.ps.ppmraw.72.0
======================================================================
ERROR: Checking doretree.ps (ppmraw/72dpi/banded) against baseline
----------------------------------------------------------------------
Traceback (most recent call last):
  File "/home/regression/regression/gstestgs.py", line 158, in runTest
    self.assertEqual(sum, gssum.get_sum(file), 'md5sum did not match baseline (' + file + ') for file: ' + self.file)
  File "/home/regression/regression/gssum.py", line 43, in get_sum
    sum = db[file]
KeyError: doretree.ps.ppmraw.72.1
======================================================================
ERROR: Checking doretree.ps (ppmraw/300dpi/noband) against baseline
----------------------------------------------------------------------
Traceback (most recent call last):
  File "/home/regression/regression/gstestgs.py", line 158, in runTest
    self.assertEqual(sum, gssum.get_sum(file), 'md5sum did not match baseline (' + file + ') for file: ' + self.file)
  File "/home/regression/regression/gssum.py", line 43, in get_sum
    sum = db[file]
KeyError: doretree.ps.ppmraw.300.0
======================================================================
ERROR: Checking doretree.ps (ppmraw/300dpi/banded) against baseline
----------------------------------------------------------------------
Traceback (most recent call last):
  File "/home/regression/regression/gstestgs.py", line 158, in runTest
    self.assertEqual(sum, gssum.get_sum(file), 'md5sum did not match baseline (' + file + ') for file: ' + self.file)
  File "/home/regression/regression/gssum.py", line 43, in get_sum
    sum = db[file]
KeyError: doretree.ps.ppmraw.300.1
======================================================================
ERROR: Checking doretree.ps (pkmraw/72dpi/noband) against baseline
----------------------------------------------------------------------
Traceback (most recent call last):
  File "/home/regression/regression/gstestgs.py", line 158, in runTest
    self.assertEqual(sum, gssum.get_sum(file), 'md5sum did not match baseline (' + file + ') for file: ' + self.file)
  File "/home/regression/regression/gssum.py", line 43, in get_sum
    sum = db[file]
KeyError: doretree.ps.pkmraw.72.0
======================================================================
ERROR: Checking doretree.ps (pkmraw/72dpi/banded) against baseline
----------------------------------------------------------------------
Traceback (most recent call last):
  File "/home/regression/regression/gstestgs.py", line 158, in runTest
    self.assertEqual(sum, gssum.get_sum(file), 'md5sum did not match baseline (' + file + ') for file: ' + self.file)
  File "/home/regression/regression/gssum.py", line 43, in get_sum
    sum = db[file]
KeyError: doretree.ps.pkmraw.72.1
======================================================================
ERROR: Checking doretree.ps (pkmraw/300dpi/noband) against baseline
----------------------------------------------------------------------
Traceback (most recent call last):
  File "/home/regression/regression/gstestgs.py", line 158, in runTest
    self.assertEqual(sum, gssum.get_sum(file), 'md5sum did not match baseline (' + file + ') for file: ' + self.file)
  File "/home/regression/regression/gssum.py", line 43, in get_sum
    sum = db[file]
KeyError: doretree.ps.pkmraw.300.0
======================================================================
ERROR: Checking doretree.ps (pkmraw/300dpi/banded) against baseline
----------------------------------------------------------------------
Traceback (most recent call last):
  File "/home/regression/regression/gstestgs.py", line 158, in runTest
    self.assertEqual(sum, gssum.get_sum(file), 'md5sum did not match baseline (' + file + ') for file: ' + self.file)
  File "/home/regression/regression/gssum.py", line 43, in get_sum
    sum = db[file]
KeyError: doretree.ps.pkmraw.300.1
======================================================================
ERROR: Checking escher.ps (pbmraw/72dpi/noband) against baseline
----------------------------------------------------------------------
Traceback (most recent call last):
  File "/home/regression/regression/gstestgs.py", line 158, in runTest
    self.assertEqual(sum, gssum.get_sum(file), 'md5sum did not match baseline (' + file + ') for file: ' + self.file)
  File "/home/regression/regression/gssum.py", line 43, in get_sum
    sum = db[file]
KeyError: escher.ps.pbmraw.72.0
======================================================================
ERROR: Checking escher.ps (pbmraw/72dpi/banded) against baseline
----------------------------------------------------------------------
Traceback (most recent call last):
  File "/home/regression/regression/gstestgs.py", line 158, in runTest
    self.assertEqual(sum, gssum.get_sum(file), 'md5sum did not match baseline (' + file + ') for file: ' + self.file)
  File "/home/regression/regression/gssum.py", line 43, in get_sum
    sum = db[file]
KeyError: escher.ps.pbmraw.72.1
======================================================================
ERROR: Checking escher.ps (pbmraw/300dpi/noband) against baseline
----------------------------------------------------------------------
Traceback (most recent call last):
  File "/home/regression/regression/gstestgs.py", line 158, in runTest
    self.assertEqual(sum, gssum.get_sum(file), 'md5sum did not match baseline (' + file + ') for file: ' + self.file)
  File "/home/regression/regression/gssum.py", line 43, in get_sum
    sum = db[file]
KeyError: escher.ps.pbmraw.300.0
======================================================================
ERROR: Checking escher.ps (pbmraw/300dpi/banded) against baseline
----------------------------------------------------------------------
Traceback (most recent call last):
  File "/home/regression/regression/gstestgs.py", line 158, in runTest
    self.assertEqual(sum, gssum.get_sum(file), 'md5sum did not match baseline (' + file + ') for file: ' + self.file)
  File "/home/regression/regression/gssum.py", line 43, in get_sum
    sum = db[file]
KeyError: escher.ps.pbmraw.300.1
======================================================================
ERROR: Checking escher.ps (pgmraw/72dpi/noband) against baseline
----------------------------------------------------------------------
Traceback (most recent call last):
  File "/home/regression/regression/gstestgs.py", line 158, in runTest
    self.assertEqual(sum, gssum.get_sum(file), 'md5sum did not match baseline (' + file + ') for file: ' + self.file)
  File "/home/regression/regression/gssum.py", line 43, in get_sum
    sum = db[file]
KeyError: escher.ps.pgmraw.72.0
======================================================================
ERROR: Checking escher.ps (pgmraw/72dpi/banded) against baseline
----------------------------------------------------------------------
Traceback (most recent call last):
  File "/home/regression/regression/gstestgs.py", line 158, in runTest
    self.assertEqual(sum, gssum.get_sum(file), 'md5sum did not match baseline (' + file + ') for file: ' + self.file)
  File "/home/regression/regression/gssum.py", line 43, in get_sum
    sum = db[file]
KeyError: escher.ps.pgmraw.72.1
======================================================================
ERROR: Checking escher.ps (pgmraw/300dpi/noband) against baseline
----------------------------------------------------------------------
Traceback (most recent call last):
  File "/home/regression/regression/gstestgs.py", line 158, in runTest
    self.assertEqual(sum, gssum.get_sum(file), 'md5sum did not match baseline (' + file + ') for file: ' + self.file)
  File "/home/regression/regression/gssum.py", line 43, in get_sum
    sum = db[file]
KeyError: escher.ps.pgmraw.300.0
======================================================================
ERROR: Checking escher.ps (pgmraw/300dpi/banded) against baseline
----------------------------------------------------------------------
Traceback (most recent call last):
  File "/home/regression/regression/gstestgs.py", line 158, in runTest
    self.assertEqual(sum, gssum.get_sum(file), 'md5sum did not match baseline (' + file + ') for file: ' + self.file)
  File "/home/regression/regression/gssum.py", line 43, in get_sum
    sum = db[file]
KeyError: escher.ps.pgmraw.300.1
======================================================================
ERROR: Checking escher.ps (ppmraw/72dpi/noband) against baseline
----------------------------------------------------------------------
Traceback (most recent call last):
  File "/home/regression/regression/gstestgs.py", line 158, in runTest
    self.assertEqual(sum, gssum.get_sum(file), 'md5sum did not match baseline (' + file + ') for file: ' + self.file)
  File "/home/regression/regression/gssum.py", line 43, in get_sum
    sum = db[file]
KeyError: escher.ps.ppmraw.72.0
======================================================================
ERROR: Checking escher.ps (ppmraw/72dpi/banded) against baseline
----------------------------------------------------------------------
Traceback (most recent call last):
  File "/home/regression/regression/gstestgs.py", line 158, in runTest
    self.assertEqual(sum, gssum.get_sum(file), 'md5sum did not match baseline (' + file + ') for file: ' + self.file)
  File "/home/regression/regression/gssum.py", line 43, in get_sum
    sum = db[file]
KeyError: escher.ps.ppmraw.72.1
======================================================================
ERROR: Checking escher.ps (ppmraw/300dpi/noband) against baseline
----------------------------------------------------------------------
Traceback (most recent call last):
  File "/home/regression/regression/gstestgs.py", line 158, in runTest
    self.assertEqual(sum, gssum.get_sum(file), 'md5sum did not match baseline (' + file + ') for file: ' + self.file)
  File "/home/regression/regression/gssum.py", line 43, in get_sum
    sum = db[file]
KeyError: escher.ps.ppmraw.300.0
======================================================================
ERROR: Checking escher.ps (ppmraw/300dpi/banded) against baseline
----------------------------------------------------------------------
Traceback (most recent call last):
  File "/home/regression/regression/gstestgs.py", line 158, in runTest
    self.assertEqual(sum, gssum.get_sum(file), 'md5sum did not match baseline (' + file + ') for file: ' + self.file)
  File "/home/regression/regression/gssum.py", line 43, in get_sum
    sum = db[file]
KeyError: escher.ps.ppmraw.300.1
======================================================================
ERROR: Checking escher.ps (pkmraw/72dpi/noband) against baseline
----------------------------------------------------------------------
Traceback (most recent call last):
  File "/home/regression/regression/gstestgs.py", line 158, in runTest
    self.assertEqual(sum, gssum.get_sum(file), 'md5sum did not match baseline (' + file + ') for file: ' + self.file)
  File "/home/regression/regression/gssum.py", line 43, in get_sum
    sum = db[file]
KeyError: escher.ps.pkmraw.72.0
======================================================================
ERROR: Checking escher.ps (pkmraw/72dpi/banded) against baseline
----------------------------------------------------------------------
Traceback (most recent call last):
  File "/home/regression/regression/gstestgs.py", line 158, in runTest
    self.assertEqual(sum, gssum.get_sum(file), 'md5sum did not match baseline (' + file + ') for file: ' + self.file)
  File "/home/regression/regression/gssum.py", line 43, in get_sum
    sum = db[file]
KeyError: escher.ps.pkmraw.72.1
======================================================================
ERROR: Checking escher.ps (pkmraw/300dpi/noband) against baseline
----------------------------------------------------------------------
Traceback (most recent call last):
  File "/home/regression/regression/gstestgs.py", line 158, in runTest
    self.assertEqual(sum, gssum.get_sum(file), 'md5sum did not match baseline (' + file + ') for file: ' + self.file)
  File "/home/regression/regression/gssum.py", line 43, in get_sum
    sum = db[file]
KeyError: escher.ps.pkmraw.300.0
======================================================================
ERROR: Checking escher.ps (pkmraw/300dpi/banded) against baseline
----------------------------------------------------------------------
Traceback (most recent call last):
  File "/home/regression/regression/gstestgs.py", line 158, in runTest
    self.assertEqual(sum, gssum.get_sum(file), 'md5sum did not match baseline (' + file + ') for file: ' + self.file)
  File "/home/regression/regression/gssum.py", line 43, in get_sum
    sum = db[file]
KeyError: escher.ps.pkmraw.300.1
======================================================================
ERROR: Checking golfer.eps (pbmraw/72dpi/noband) against baseline
----------------------------------------------------------------------
Traceback (most recent call last):
  File "/home/regression/regression/gstestgs.py", line 158, in runTest
    self.assertEqual(sum, gssum.get_sum(file), 'md5sum did not match baseline (' + file + ') for file: ' + self.file)
  File "/home/regression/regression/gssum.py", line 43, in get_sum
    sum = db[file]
KeyError: golfer.eps.pbmraw.72.0
======================================================================
ERROR: Checking golfer.eps (pbmraw/72dpi/banded) against baseline
----------------------------------------------------------------------
Traceback (most recent call last):
  File "/home/regression/regression/gstestgs.py", line 158, in runTest
    self.assertEqual(sum, gssum.get_sum(file), 'md5sum did not match baseline (' + file + ') for file: ' + self.file)
  File "/home/regression/regression/gssum.py", line 43, in get_sum
    sum = db[file]
KeyError: golfer.eps.pbmraw.72.1
======================================================================
ERROR: Checking golfer.eps (pbmraw/300dpi/noband) against baseline
----------------------------------------------------------------------
Traceback (most recent call last):
  File "/home/regression/regression/gstestgs.py", line 158, in runTest
    self.assertEqual(sum, gssum.get_sum(file), 'md5sum did not match baseline (' + file + ') for file: ' + self.file)
  File "/home/regression/regression/gssum.py", line 43, in get_sum
    sum = db[file]
KeyError: golfer.eps.pbmraw.300.0
======================================================================
ERROR: Checking golfer.eps (pbmraw/300dpi/banded) against baseline
----------------------------------------------------------------------
Traceback (most recent call last):
  File "/home/regression/regression/gstestgs.py", line 158, in runTest
    self.assertEqual(sum, gssum.get_sum(file), 'md5sum did not match baseline (' + file + ') for file: ' + self.file)
  File "/home/regression/regression/gssum.py", line 43, in get_sum
    sum = db[file]
KeyError: golfer.eps.pbmraw.300.1
======================================================================
ERROR: Checking golfer.eps (pgmraw/72dpi/noband) against baseline
----------------------------------------------------------------------
Traceback (most recent call last):
  File "/home/regression/regression/gstestgs.py", line 158, in runTest
    self.assertEqual(sum, gssum.get_sum(file), 'md5sum did not match baseline (' + file + ') for file: ' + self.file)
  File "/home/regression/regression/gssum.py", line 43, in get_sum
    sum = db[file]
KeyError: golfer.eps.pgmraw.72.0
======================================================================
ERROR: Checking golfer.eps (pgmraw/72dpi/banded) against baseline
----------------------------------------------------------------------
Traceback (most recent call last):
  File "/home/regression/regression/gstestgs.py", line 158, in runTest
    self.assertEqual(sum, gssum.get_sum(file), 'md5sum did not match baseline (' + file + ') for file: ' + self.file)
  File "/home/regression/regression/gssum.py", line 43, in get_sum
    sum = db[file]
KeyError: golfer.eps.pgmraw.72.1
======================================================================
ERROR: Checking golfer.eps (pgmraw/300dpi/noband) against baseline
----------------------------------------------------------------------
Traceback (most recent call last):
  File "/home/regression/regression/gstestgs.py", line 158, in runTest
    self.assertEqual(sum, gssum.get_sum(file), 'md5sum did not match baseline (' + file + ') for file: ' + self.file)
  File "/home/regression/regression/gssum.py", line 43, in get_sum
    sum = db[file]
KeyError: golfer.eps.pgmraw.300.0
======================================================================
ERROR: Checking golfer.eps (pgmraw/300dpi/banded) against baseline
----------------------------------------------------------------------
Traceback (most recent call last):
  File "/home/regression/regression/gstestgs.py", line 158, in runTest
    self.assertEqual(sum, gssum.get_sum(file), 'md5sum did not match baseline (' + file + ') for file: ' + self.file)
  File "/home/regression/regression/gssum.py", line 43, in get_sum
    sum = db[file]
KeyError: golfer.eps.pgmraw.300.1
======================================================================
ERROR: Checking golfer.eps (ppmraw/72dpi/noband) against baseline
----------------------------------------------------------------------
Traceback (most recent call last):
  File "/home/regression/regression/gstestgs.py", line 158, in runTest
    self.assertEqual(sum, gssum.get_sum(file), 'md5sum did not match baseline (' + file + ') for file: ' + self.file)
  File "/home/regression/regression/gssum.py", line 43, in get_sum
    sum = db[file]
KeyError: golfer.eps.ppmraw.72.0
======================================================================
ERROR: Checking golfer.eps (ppmraw/72dpi/banded) against baseline
----------------------------------------------------------------------
Traceback (most recent call last):
  File "/home/regression/regression/gstestgs.py", line 158, in runTest
    self.assertEqual(sum, gssum.get_sum(file), 'md5sum did not match baseline (' + file + ') for file: ' + self.file)
  File "/home/regression/regression/gssum.py", line 43, in get_sum
    sum = db[file]
KeyError: golfer.eps.ppmraw.72.1
======================================================================
ERROR: Checking golfer.eps (ppmraw/300dpi/noband) against baseline
----------------------------------------------------------------------
Traceback (most recent call last):
  File "/home/regression/regression/gstestgs.py", line 158, in runTest
    self.assertEqual(sum, gssum.get_sum(file), 'md5sum did not match baseline (' + file + ') for file: ' + self.file)
  File "/home/regression/regression/gssum.py", line 43, in get_sum
    sum = db[file]
KeyError: golfer.eps.ppmraw.300.0
======================================================================
ERROR: Checking golfer.eps (ppmraw/300dpi/banded) against baseline
----------------------------------------------------------------------
Traceback (most recent call last):
  File "/home/regression/regression/gstestgs.py", line 158, in runTest
    self.assertEqual(sum, gssum.get_sum(file), 'md5sum did not match baseline (' + file + ') for file: ' + self.file)
  File "/home/regression/regression/gssum.py", line 43, in get_sum
    sum = db[file]
KeyError: golfer.eps.ppmraw.300.1
======================================================================
ERROR: Checking golfer.eps (pkmraw/72dpi/noband) against baseline
----------------------------------------------------------------------
Traceback (most recent call last):
  File "/home/regression/regression/gstestgs.py", line 158, in runTest
    self.assertEqual(sum, gssum.get_sum(file), 'md5sum did not match baseline (' + file + ') for file: ' + self.file)
  File "/home/regression/regression/gssum.py", line 43, in get_sum
    sum = db[file]
KeyError: golfer.eps.pkmraw.72.0
======================================================================
ERROR: Checking golfer.eps (pkmraw/72dpi/banded) against baseline
----------------------------------------------------------------------
Traceback (most recent call last):
  File "/home/regression/regression/gstestgs.py", line 158, in runTest
    self.assertEqual(sum, gssum.get_sum(file), 'md5sum did not match baseline (' + file + ') for file: ' + self.file)
  File "/home/regression/regression/gssum.py", line 43, in get_sum
    sum = db[file]
KeyError: golfer.eps.pkmraw.72.1
======================================================================
ERROR: Checking golfer.eps (pkmraw/300dpi/noband) against baseline
----------------------------------------------------------------------
Traceback (most recent call last):
  File "/home/regression/regression/gstestgs.py", line 158, in runTest
    self.assertEqual(sum, gssum.get_sum(file), 'md5sum did not match baseline (' + file + ') for file: ' + self.file)
  File "/home/regression/regression/gssum.py", line 43, in get_sum
    sum = db[file]
KeyError: golfer.eps.pkmraw.300.0
======================================================================
ERROR: Checking golfer.eps (pkmraw/300dpi/banded) against baseline
----------------------------------------------------------------------
Traceback (most recent call last):
  File "/home/regression/regression/gstestgs.py", line 158, in runTest
    self.assertEqual(sum, gssum.get_sum(file), 'md5sum did not match baseline (' + file + ') for file: ' + self.file)
  File "/home/regression/regression/gssum.py", line 43, in get_sum
    sum = db[file]
KeyError: golfer.eps.pkmraw.300.1
======================================================================
ERROR: Checking grayalph.ps (pbmraw/72dpi/noband) against baseline
----------------------------------------------------------------------
Traceback (most recent call last):
  File "/home/regression/regression/gstestgs.py", line 158, in runTest
    self.assertEqual(sum, gssum.get_sum(file), 'md5sum did not match baseline (' + file + ') for file: ' + self.file)
  File "/home/regression/regression/gssum.py", line 43, in get_sum
    sum = db[file]
KeyError: grayalph.ps.pbmraw.72.0
======================================================================
ERROR: Checking grayalph.ps (pbmraw/72dpi/banded) against baseline
----------------------------------------------------------------------
Traceback (most recent call last):
  File "/home/regression/regression/gstestgs.py", line 158, in runTest
    self.assertEqual(sum, gssum.get_sum(file), 'md5sum did not match baseline (' + file + ') for file: ' + self.file)
  File "/home/regression/regression/gssum.py", line 43, in get_sum
    sum = db[file]
KeyError: grayalph.ps.pbmraw.72.1
======================================================================
ERROR: Checking grayalph.ps (pbmraw/300dpi/noband) against baseline
----------------------------------------------------------------------
Traceback (most recent call last):
  File "/home/regression/regression/gstestgs.py", line 158, in runTest
    self.assertEqual(sum, gssum.get_sum(file), 'md5sum did not match baseline (' + file + ') for file: ' + self.file)
  File "/home/regression/regression/gssum.py", line 43, in get_sum
    sum = db[file]
KeyError: grayalph.ps.pbmraw.300.0
======================================================================
ERROR: Checking grayalph.ps (pbmraw/300dpi/banded) against baseline
----------------------------------------------------------------------
Traceback (most recent call last):
  File "/home/regression/regression/gstestgs.py", line 158, in runTest
    self.assertEqual(sum, gssum.get_sum(file), 'md5sum did not match baseline (' + file + ') for file: ' + self.file)
  File "/home/regression/regression/gssum.py", line 43, in get_sum
    sum = db[file]
KeyError: grayalph.ps.pbmraw.300.1
======================================================================
ERROR: Checking grayalph.ps (pgmraw/72dpi/noband) against baseline
----------------------------------------------------------------------
Traceback (most recent call last):
  File "/home/regression/regression/gstestgs.py", line 158, in runTest
    self.assertEqual(sum, gssum.get_sum(file), 'md5sum did not match baseline (' + file + ') for file: ' + self.file)
  File "/home/regression/regression/gssum.py", line 43, in get_sum
    sum = db[file]
KeyError: grayalph.ps.pgmraw.72.0
======================================================================
ERROR: Checking grayalph.ps (pgmraw/72dpi/banded) against baseline
----------------------------------------------------------------------
Traceback (most recent call last):
  File "/home/regression/regression/gstestgs.py", line 158, in runTest
    self.assertEqual(sum, gssum.get_sum(file), 'md5sum did not match baseline (' + file + ') for file: ' + self.file)
  File "/home/regression/regression/gssum.py", line 43, in get_sum
    sum = db[file]
KeyError: grayalph.ps.pgmraw.72.1
======================================================================
ERROR: Checking grayalph.ps (pgmraw/300dpi/noband) against baseline
----------------------------------------------------------------------
Traceback (most recent call last):
  File "/home/regression/regression/gstestgs.py", line 158, in runTest
    self.assertEqual(sum, gssum.get_sum(file), 'md5sum did not match baseline (' + file + ') for file: ' + self.file)
  File "/home/regression/regression/gssum.py", line 43, in get_sum
    sum = db[file]
KeyError: grayalph.ps.pgmraw.300.0
======================================================================
ERROR: Checking grayalph.ps (pgmraw/300dpi/banded) against baseline
----------------------------------------------------------------------
Traceback (most recent call last):
  File "/home/regression/regression/gstestgs.py", line 158, in runTest
    self.assertEqual(sum, gssum.get_sum(file), 'md5sum did not match baseline (' + file + ') for file: ' + self.file)
  File "/home/regression/regression/gssum.py", line 43, in get_sum
    sum = db[file]
KeyError: grayalph.ps.pgmraw.300.1
======================================================================
ERROR: Checking grayalph.ps (ppmraw/72dpi/noband) against baseline
----------------------------------------------------------------------
Traceback (most recent call last):
  File "/home/regression/regression/gstestgs.py", line 158, in runTest
    self.assertEqual(sum, gssum.get_sum(file), 'md5sum did not match baseline (' + file + ') for file: ' + self.file)
  File "/home/regression/regression/gssum.py", line 43, in get_sum
    sum = db[file]
KeyError: grayalph.ps.ppmraw.72.0
======================================================================
ERROR: Checking grayalph.ps (ppmraw/72dpi/banded) against baseline
----------------------------------------------------------------------
Traceback (most recent call last):
  File "/home/regression/regression/gstestgs.py", line 158, in runTest
    self.assertEqual(sum, gssum.get_sum(file), 'md5sum did not match baseline (' + file + ') for file: ' + self.file)
  File "/home/regression/regression/gssum.py", line 43, in get_sum
    sum = db[file]
KeyError: grayalph.ps.ppmraw.72.1
======================================================================
ERROR: Checking grayalph.ps (ppmraw/300dpi/noband) against baseline
----------------------------------------------------------------------
Traceback (most recent call last):
  File "/home/regression/regression/gstestgs.py", line 158, in runTest
    self.assertEqual(sum, gssum.get_sum(file), 'md5sum did not match baseline (' + file + ') for file: ' + self.file)
  File "/home/regression/regression/gssum.py", line 43, in get_sum
    sum = db[file]
KeyError: grayalph.ps.ppmraw.300.0
======================================================================
ERROR: Checking grayalph.ps (ppmraw/300dpi/banded) against baseline
----------------------------------------------------------------------
Traceback (most recent call last):
  File "/home/regression/regression/gstestgs.py", line 158, in runTest
    self.assertEqual(sum, gssum.get_sum(file), 'md5sum did not match baseline (' + file + ') for file: ' + self.file)
  File "/home/regression/regression/gssum.py", line 43, in get_sum
    sum = db[file]
KeyError: grayalph.ps.ppmraw.300.1
======================================================================
ERROR: Checking grayalph.ps (pkmraw/72dpi/noband) against baseline
----------------------------------------------------------------------
Traceback (most recent call last):
  File "/home/regression/regression/gstestgs.py", line 158, in runTest
    self.assertEqual(sum, gssum.get_sum(file), 'md5sum did not match baseline (' + file + ') for file: ' + self.file)
  File "/home/regression/regression/gssum.py", line 43, in get_sum
    sum = db[file]
KeyError: grayalph.ps.pkmraw.72.0
======================================================================
ERROR: Checking grayalph.ps (pkmraw/72dpi/banded) against baseline
----------------------------------------------------------------------
Traceback (most recent call last):
  File "/home/regression/regression/gstestgs.py", line 158, in runTest
    self.assertEqual(sum, gssum.get_sum(file), 'md5sum did not match baseline (' + file + ') for file: ' + self.file)
  File "/home/regression/regression/gssum.py", line 43, in get_sum
    sum = db[file]
KeyError: grayalph.ps.pkmraw.72.1
======================================================================
ERROR: Checking grayalph.ps (pkmraw/300dpi/noband) against baseline
----------------------------------------------------------------------
Traceback (most recent call last):
  File "/home/regression/regression/gstestgs.py", line 158, in runTest
    self.assertEqual(sum, gssum.get_sum(file), 'md5sum did not match baseline (' + file + ') for file: ' + self.file)
  File "/home/regression/regression/gssum.py", line 43, in get_sum
    sum = db[file]
KeyError: grayalph.ps.pkmraw.300.0
======================================================================
ERROR: Checking grayalph.ps (pkmraw/300dpi/banded) against baseline
----------------------------------------------------------------------
Traceback (most recent call last):
  File "/home/regression/regression/gstestgs.py", line 158, in runTest
    self.assertEqual(sum, gssum.get_sum(file), 'md5sum did not match baseline (' + file + ') for file: ' + self.file)
  File "/home/regression/regression/gssum.py", line 43, in get_sum
    sum = db[file]
KeyError: grayalph.ps.pkmraw.300.1
======================================================================
ERROR: Checking ridt91.eps (pbmraw/72dpi/noband) against baseline
----------------------------------------------------------------------
Traceback (most recent call last):
  File "/home/regression/regression/gstestgs.py", line 151, in runTest
    sum = gssum.make_sum(file)
  File "/home/regression/regression/gssum.py", line 52, in make_sum
    mode = os.stat(file)[ST_MODE]
OSError: [Errno 2] No such file or directory: 'ridt91.eps.pbmraw.72.0'
======================================================================
ERROR: Checking ridt91.eps (pbmraw/72dpi/banded) against baseline
----------------------------------------------------------------------
Traceback (most recent call last):
  File "/home/regression/regression/gstestgs.py", line 151, in runTest
    sum = gssum.make_sum(file)
  File "/home/regression/regression/gssum.py", line 52, in make_sum
    mode = os.stat(file)[ST_MODE]
OSError: [Errno 2] No such file or directory: 'ridt91.eps.pbmraw.72.1'
======================================================================
ERROR: Checking ridt91.eps (pbmraw/300dpi/noband) against baseline
----------------------------------------------------------------------
Traceback (most recent call last):
  File "/home/regression/regression/gstestgs.py", line 151, in runTest
    sum = gssum.make_sum(file)
  File "/home/regression/regression/gssum.py", line 52, in make_sum
    mode = os.stat(file)[ST_MODE]
OSError: [Errno 2] No such file or directory: 'ridt91.eps.pbmraw.300.0'
======================================================================
ERROR: Checking ridt91.eps (pbmraw/300dpi/banded) against baseline
----------------------------------------------------------------------
Traceback (most recent call last):
  File "/home/regression/regression/gstestgs.py", line 151, in runTest
    sum = gssum.make_sum(file)
  File "/home/regression/regression/gssum.py", line 52, in make_sum
    mode = os.stat(file)[ST_MODE]
OSError: [Errno 2] No such file or directory: 'ridt91.eps.pbmraw.300.1'
======================================================================
ERROR: Checking ridt91.eps (pgmraw/72dpi/noband) against baseline
----------------------------------------------------------------------
Traceback (most recent call last):
  File "/home/regression/regression/gstestgs.py", line 151, in runTest
    sum = gssum.make_sum(file)
  File "/home/regression/regression/gssum.py", line 52, in make_sum
    mode = os.stat(file)[ST_MODE]
OSError: [Errno 2] No such file or directory: 'ridt91.eps.pgmraw.72.0'
======================================================================
ERROR: Checking ridt91.eps (pgmraw/72dpi/banded) against baseline
----------------------------------------------------------------------
Traceback (most recent call last):
  File "/home/regression/regression/gstestgs.py", line 151, in runTest
    sum = gssum.make_sum(file)
  File "/home/regression/regression/gssum.py", line 52, in make_sum
    mode = os.stat(file)[ST_MODE]
OSError: [Errno 2] No such file or directory: 'ridt91.eps.pgmraw.72.1'
======================================================================
ERROR: Checking ridt91.eps (pgmraw/300dpi/noband) against baseline
----------------------------------------------------------------------
Traceback (most recent call last):
  File "/home/regression/regression/gstestgs.py", line 151, in runTest
    sum = gssum.make_sum(file)
  File "/home/regression/regression/gssum.py", line 52, in make_sum
    mode = os.stat(file)[ST_MODE]
OSError: [Errno 2] No such file or directory: 'ridt91.eps.pgmraw.300.0'
======================================================================
ERROR: Checking ridt91.eps (pgmraw/300dpi/banded) against baseline
----------------------------------------------------------------------
Traceback (most recent call last):
  File "/home/regression/regression/gstestgs.py", line 151, in runTest
    sum = gssum.make_sum(file)
  File "/home/regression/regression/gssum.py", line 52, in make_sum
    mode = os.stat(file)[ST_MODE]
OSError: [Errno 2] No such file or directory: 'ridt91.eps.pgmraw.300.1'
======================================================================
ERROR: Checking ridt91.eps (ppmraw/72dpi/noband) against baseline
----------------------------------------------------------------------
Traceback (most recent call last):
  File "/home/regression/regression/gstestgs.py", line 151, in runTest
    sum = gssum.make_sum(file)
  File "/home/regression/regression/gssum.py", line 52, in make_sum
    mode = os.stat(file)[ST_MODE]
OSError: [Errno 2] No such file or directory: 'ridt91.eps.ppmraw.72.0'
======================================================================
ERROR: Checking ridt91.eps (ppmraw/72dpi/banded) against baseline
----------------------------------------------------------------------
Traceback (most recent call last):
  File "/home/regression/regression/gstestgs.py", line 151, in runTest
    sum = gssum.make_sum(file)
  File "/home/regression/regression/gssum.py", line 52, in make_sum
    mode = os.stat(file)[ST_MODE]
OSError: [Errno 2] No such file or directory: 'ridt91.eps.ppmraw.72.1'
======================================================================
ERROR: Checking ridt91.eps (ppmraw/300dpi/noband) against baseline
----------------------------------------------------------------------
Traceback (most recent call last):
  File "/home/regression/regression/gstestgs.py", line 151, in runTest
    sum = gssum.make_sum(file)
  File "/home/regression/regression/gssum.py", line 52, in make_sum
    mode = os.stat(file)[ST_MODE]
OSError: [Errno 2] No such file or directory: 'ridt91.eps.ppmraw.300.0'
======================================================================
ERROR: Checking ridt91.eps (ppmraw/300dpi/banded) against baseline
----------------------------------------------------------------------
Traceback (most recent call last):
  File "/home/regression/regression/gstestgs.py", line 151, in runTest
    sum = gssum.make_sum(file)
  File "/home/regression/regression/gssum.py", line 52, in make_sum
    mode = os.stat(file)[ST_MODE]
OSError: [Errno 2] No such file or directory: 'ridt91.eps.ppmraw.300.1'
======================================================================
ERROR: Checking ridt91.eps (pkmraw/72dpi/noband) against baseline
----------------------------------------------------------------------
Traceback (most recent call last):
  File "/home/regression/regression/gstestgs.py", line 151, in runTest
    sum = gssum.make_sum(file)
  File "/home/regression/regression/gssum.py", line 52, in make_sum
    mode = os.stat(file)[ST_MODE]
OSError: [Errno 2] No such file or directory: 'ridt91.eps.pkmraw.72.0'
======================================================================
ERROR: Checking ridt91.eps (pkmraw/72dpi/banded) against baseline
----------------------------------------------------------------------
Traceback (most recent call last):
  File "/home/regression/regression/gstestgs.py", line 151, in runTest
    sum = gssum.make_sum(file)
  File "/home/regression/regression/gssum.py", line 52, in make_sum
    mode = os.stat(file)[ST_MODE]
OSError: [Errno 2] No such file or directory: 'ridt91.eps.pkmraw.72.1'
======================================================================
ERROR: Checking ridt91.eps (pkmraw/300dpi/noband) against baseline
----------------------------------------------------------------------
Traceback (most recent call last):
  File "/home/regression/regression/gstestgs.py", line 151, in runTest
    sum = gssum.make_sum(file)
  File "/home/regression/regression/gssum.py", line 52, in make_sum
    mode = os.stat(file)[ST_MODE]
OSError: [Errno 2] No such file or directory: 'ridt91.eps.pkmraw.300.0'
======================================================================
ERROR: Checking ridt91.eps (pkmraw/300dpi/banded) against baseline
----------------------------------------------------------------------
Traceback (most recent call last):
  File "/home/regression/regression/gstestgs.py", line 151, in runTest
    sum = gssum.make_sum(file)
  File "/home/regression/regression/gssum.py", line 52, in make_sum
    mode = os.stat(file)[ST_MODE]
OSError: [Errno 2] No such file or directory: 'ridt91.eps.pkmraw.300.1'
======================================================================
ERROR: Checking snowflak.ps (pbmraw/72dpi/noband) against baseline
----------------------------------------------------------------------
Traceback (most recent call last):
  File "/home/regression/regression/gstestgs.py", line 158, in runTest
    self.assertEqual(sum, gssum.get_sum(file), 'md5sum did not match baseline (' + file + ') for file: ' + self.file)
  File "/home/regression/regression/gssum.py", line 43, in get_sum
    sum = db[file]
KeyError: snowflak.ps.pbmraw.72.0
======================================================================
ERROR: Checking snowflak.ps (pbmraw/72dpi/banded) against baseline
----------------------------------------------------------------------
Traceback (most recent call last):
  File "/home/regression/regression/gstestgs.py", line 158, in runTest
    self.assertEqual(sum, gssum.get_sum(file), 'md5sum did not match baseline (' + file + ') for file: ' + self.file)
  File "/home/regression/regression/gssum.py", line 43, in get_sum
    sum = db[file]
KeyError: snowflak.ps.pbmraw.72.1
======================================================================
ERROR: Checking snowflak.ps (pbmraw/300dpi/noband) against baseline
----------------------------------------------------------------------
Traceback (most recent call last):
  File "/home/regression/regression/gstestgs.py", line 158, in runTest
    self.assertEqual(sum, gssum.get_sum(file), 'md5sum did not match baseline (' + file + ') for file: ' + self.file)
  File "/home/regression/regression/gssum.py", line 43, in get_sum
    sum = db[file]
KeyError: snowflak.ps.pbmraw.300.0
======================================================================
ERROR: Checking snowflak.ps (pbmraw/300dpi/banded) against baseline
----------------------------------------------------------------------
Traceback (most recent call last):
  File "/home/regression/regression/gstestgs.py", line 158, in runTest
    self.assertEqual(sum, gssum.get_sum(file), 'md5sum did not match baseline (' + file + ') for file: ' + self.file)
  File "/home/regression/regression/gssum.py", line 43, in get_sum
    sum = db[file]
KeyError: snowflak.ps.pbmraw.300.1
======================================================================
ERROR: Checking snowflak.ps (pgmraw/72dpi/noband) against baseline
----------------------------------------------------------------------
Traceback (most recent call last):
  File "/home/regression/regression/gstestgs.py", line 158, in runTest
    self.assertEqual(sum, gssum.get_sum(file), 'md5sum did not match baseline (' + file + ') for file: ' + self.file)
  File "/home/regression/regression/gssum.py", line 43, in get_sum
    sum = db[file]
KeyError: snowflak.ps.pgmraw.72.0
======================================================================
ERROR: Checking snowflak.ps (pgmraw/72dpi/banded) against baseline
----------------------------------------------------------------------
Traceback (most recent call last):
  File "/home/regression/regression/gstestgs.py", line 158, in runTest
    self.assertEqual(sum, gssum.get_sum(file), 'md5sum did not match baseline (' + file + ') for file: ' + self.file)
  File "/home/regression/regression/gssum.py", line 43, in get_sum
    sum = db[file]
KeyError: snowflak.ps.pgmraw.72.1
======================================================================
ERROR: Checking snowflak.ps (pgmraw/300dpi/noband) against baseline
----------------------------------------------------------------------
Traceback (most recent call last):
  File "/home/regression/regression/gstestgs.py", line 158, in runTest
    self.assertEqual(sum, gssum.get_sum(file), 'md5sum did not match baseline (' + file + ') for file: ' + self.file)
  File "/home/regression/regression/gssum.py", line 43, in get_sum
    sum = db[file]
KeyError: snowflak.ps.pgmraw.300.0
======================================================================
ERROR: Checking snowflak.ps (pgmraw/300dpi/banded) against baseline
----------------------------------------------------------------------
Traceback (most recent call last):
  File "/home/regression/regression/gstestgs.py", line 158, in runTest
    self.assertEqual(sum, gssum.get_sum(file), 'md5sum did not match baseline (' + file + ') for file: ' + self.file)
  File "/home/regression/regression/gssum.py", line 43, in get_sum
    sum = db[file]
KeyError: snowflak.ps.pgmraw.300.1
======================================================================
ERROR: Checking snowflak.ps (ppmraw/72dpi/noband) against baseline
----------------------------------------------------------------------
Traceback (most recent call last):
  File "/home/regression/regression/gstestgs.py", line 158, in runTest
    self.assertEqual(sum, gssum.get_sum(file), 'md5sum did not match baseline (' + file + ') for file: ' + self.file)
  File "/home/regression/regression/gssum.py", line 43, in get_sum
    sum = db[file]
KeyError: snowflak.ps.ppmraw.72.0
======================================================================
ERROR: Checking snowflak.ps (ppmraw/72dpi/banded) against baseline
----------------------------------------------------------------------
Traceback (most recent call last):
  File "/home/regression/regression/gstestgs.py", line 158, in runTest
    self.assertEqual(sum, gssum.get_sum(file), 'md5sum did not match baseline (' + file + ') for file: ' + self.file)
  File "/home/regression/regression/gssum.py", line 43, in get_sum
    sum = db[file]
KeyError: snowflak.ps.ppmraw.72.1
======================================================================
ERROR: Checking snowflak.ps (ppmraw/300dpi/noband) against baseline
----------------------------------------------------------------------
Traceback (most recent call last):
  File "/home/regression/regression/gstestgs.py", line 158, in runTest
    self.assertEqual(sum, gssum.get_sum(file), 'md5sum did not match baseline (' + file + ') for file: ' + self.file)
  File "/home/regression/regression/gssum.py", line 43, in get_sum
    sum = db[file]
KeyError: snowflak.ps.ppmraw.300.0
======================================================================
ERROR: Checking snowflak.ps (ppmraw/300dpi/banded) against baseline
----------------------------------------------------------------------
Traceback (most recent call last):
  File "/home/regression/regression/gstestgs.py", line 158, in runTest
    self.assertEqual(sum, gssum.get_sum(file), 'md5sum did not match baseline (' + file + ') for file: ' + self.file)
  File "/home/regression/regression/gssum.py", line 43, in get_sum
    sum = db[file]
KeyError: snowflak.ps.ppmraw.300.1
======================================================================
ERROR: Checking snowflak.ps (pkmraw/72dpi/noband) against baseline
----------------------------------------------------------------------
Traceback (most recent call last):
  File "/home/regression/regression/gstestgs.py", line 158, in runTest
    self.assertEqual(sum, gssum.get_sum(file), 'md5sum did not match baseline (' + file + ') for file: ' + self.file)
  File "/home/regression/regression/gssum.py", line 43, in get_sum
    sum = db[file]
KeyError: snowflak.ps.pkmraw.72.0
======================================================================
ERROR: Checking snowflak.ps (pkmraw/72dpi/banded) against baseline
----------------------------------------------------------------------
Traceback (most recent call last):
  File "/home/regression/regression/gstestgs.py", line 158, in runTest
    self.assertEqual(sum, gssum.get_sum(file), 'md5sum did not match baseline (' + file + ') for file: ' + self.file)
  File "/home/regression/regression/gssum.py", line 43, in get_sum
    sum = db[file]
KeyError: snowflak.ps.pkmraw.72.1
======================================================================
ERROR: Checking snowflak.ps (pkmraw/300dpi/noband) against baseline
----------------------------------------------------------------------
Traceback (most recent call last):
  File "/home/regression/regression/gstestgs.py", line 158, in runTest
    self.assertEqual(sum, gssum.get_sum(file), 'md5sum did not match baseline (' + file + ') for file: ' + self.file)
  File "/home/regression/regression/gssum.py", line 43, in get_sum
    sum = db[file]
KeyError: snowflak.ps.pkmraw.300.0
======================================================================
ERROR: Checking snowflak.ps (pkmraw/300dpi/banded) against baseline
----------------------------------------------------------------------
Traceback (most recent call last):
  File "/home/regression/regression/gstestgs.py", line 158, in runTest
    self.assertEqual(sum, gssum.get_sum(file), 'md5sum did not match baseline (' + file + ') for file: ' + self.file)
  File "/home/regression/regression/gssum.py", line 43, in get_sum
    sum = db[file]
KeyError: snowflak.ps.pkmraw.300.1
======================================================================
ERROR: Checking tiger.eps (pbmraw/72dpi/noband) against baseline
----------------------------------------------------------------------
Traceback (most recent call last):
  File "/home/regression/regression/gstestgs.py", line 158, in runTest
    self.assertEqual(sum, gssum.get_sum(file), 'md5sum did not match baseline (' + file + ') for file: ' + self.file)
  File "/home/regression/regression/gssum.py", line 43, in get_sum
    sum = db[file]
KeyError: tiger.eps.pbmraw.72.0
======================================================================
ERROR: Checking tiger.eps (pbmraw/72dpi/banded) against baseline
----------------------------------------------------------------------
Traceback (most recent call last):
  File "/home/regression/regression/gstestgs.py", line 158, in runTest
    self.assertEqual(sum, gssum.get_sum(file), 'md5sum did not match baseline (' + file + ') for file: ' + self.file)
  File "/home/regression/regression/gssum.py", line 43, in get_sum
    sum = db[file]
KeyError: tiger.eps.pbmraw.72.1
======================================================================
ERROR: Checking tiger.eps (pbmraw/300dpi/noband) against baseline
----------------------------------------------------------------------
Traceback (most recent call last):
  File "/home/regression/regression/gstestgs.py", line 158, in runTest
    self.assertEqual(sum, gssum.get_sum(file), 'md5sum did not match baseline (' + file + ') for file: ' + self.file)
  File "/home/regression/regression/gssum.py", line 43, in get_sum
    sum = db[file]
KeyError: tiger.eps.pbmraw.300.0
======================================================================
ERROR: Checking tiger.eps (pbmraw/300dpi/banded) against baseline
----------------------------------------------------------------------
Traceback (most recent call last):
  File "/home/regression/regression/gstestgs.py", line 158, in runTest
    self.assertEqual(sum, gssum.get_sum(file), 'md5sum did not match baseline (' + file + ') for file: ' + self.file)
  File "/home/regression/regression/gssum.py", line 43, in get_sum
    sum = db[file]
KeyError: tiger.eps.pbmraw.300.1
======================================================================
ERROR: Checking tiger.eps (pgmraw/72dpi/noband) against baseline
----------------------------------------------------------------------
Traceback (most recent call last):
  File "/home/regression/regression/gstestgs.py", line 158, in runTest
    self.assertEqual(sum, gssum.get_sum(file), 'md5sum did not match baseline (' + file + ') for file: ' + self.file)
  File "/home/regression/regression/gssum.py", line 43, in get_sum
    sum = db[file]
KeyError: tiger.eps.pgmraw.72.0
======================================================================
ERROR: Checking tiger.eps (pgmraw/72dpi/banded) against baseline
----------------------------------------------------------------------
Traceback (most recent call last):
  File "/home/regression/regression/gstestgs.py", line 158, in runTest
    self.assertEqual(sum, gssum.get_sum(file), 'md5sum did not match baseline (' + file + ') for file: ' + self.file)
  File "/home/regression/regression/gssum.py", line 43, in get_sum
    sum = db[file]
KeyError: tiger.eps.pgmraw.72.1
======================================================================
ERROR: Checking tiger.eps (pgmraw/300dpi/noband) against baseline
----------------------------------------------------------------------
Traceback (most recent call last):
  File "/home/regression/regression/gstestgs.py", line 158, in runTest
    self.assertEqual(sum, gssum.get_sum(file), 'md5sum did not match baseline (' + file + ') for file: ' + self.file)
  File "/home/regression/regression/gssum.py", line 43, in get_sum
    sum = db[file]
KeyError: tiger.eps.pgmraw.300.0
======================================================================
ERROR: Checking tiger.eps (pgmraw/300dpi/banded) against baseline
----------------------------------------------------------------------
Traceback (most recent call last):
  File "/home/regression/regression/gstestgs.py", line 158, in runTest
    self.assertEqual(sum, gssum.get_sum(file), 'md5sum did not match baseline (' + file + ') for file: ' + self.file)
  File "/home/regression/regression/gssum.py", line 43, in get_sum
    sum = db[file]
KeyError: tiger.eps.pgmraw.300.1
======================================================================
ERROR: Checking tiger.eps (ppmraw/72dpi/noband) against baseline
----------------------------------------------------------------------
Traceback (most recent call last):
  File "/home/regression/regression/gstestgs.py", line 158, in runTest
    self.assertEqual(sum, gssum.get_sum(file), 'md5sum did not match baseline (' + file + ') for file: ' + self.file)
  File "/home/regression/regression/gssum.py", line 43, in get_sum
    sum = db[file]
KeyError: tiger.eps.ppmraw.72.0
======================================================================
ERROR: Checking tiger.eps (ppmraw/72dpi/banded) against baseline
----------------------------------------------------------------------
Traceback (most recent call last):
  File "/home/regression/regression/gstestgs.py", line 158, in runTest
    self.assertEqual(sum, gssum.get_sum(file), 'md5sum did not match baseline (' + file + ') for file: ' + self.file)
  File "/home/regression/regression/gssum.py", line 43, in get_sum
    sum = db[file]
KeyError: tiger.eps.ppmraw.72.1
======================================================================
ERROR: Checking tiger.eps (ppmraw/300dpi/noband) against baseline
----------------------------------------------------------------------
Traceback (most recent call last):
  File "/home/regression/regression/gstestgs.py", line 158, in runTest
    self.assertEqual(sum, gssum.get_sum(file), 'md5sum did not match baseline (' + file + ') for file: ' + self.file)
  File "/home/regression/regression/gssum.py", line 43, in get_sum
    sum = db[file]
KeyError: tiger.eps.ppmraw.300.0
======================================================================
ERROR: Checking tiger.eps (ppmraw/300dpi/banded) against baseline
----------------------------------------------------------------------
Traceback (most recent call last):
  File "/home/regression/regression/gstestgs.py", line 158, in runTest
    self.assertEqual(sum, gssum.get_sum(file), 'md5sum did not match baseline (' + file + ') for file: ' + self.file)
  File "/home/regression/regression/gssum.py", line 43, in get_sum
    sum = db[file]
KeyError: tiger.eps.ppmraw.300.1
======================================================================
ERROR: Checking tiger.eps (pkmraw/72dpi/noband) against baseline
----------------------------------------------------------------------
Traceback (most recent call last):
  File "/home/regression/regression/gstestgs.py", line 158, in runTest
    self.assertEqual(sum, gssum.get_sum(file), 'md5sum did not match baseline (' + file + ') for file: ' + self.file)
  File "/home/regression/regression/gssum.py", line 43, in get_sum
    sum = db[file]
KeyError: tiger.eps.pkmraw.72.0
======================================================================
ERROR: Checking tiger.eps (pkmraw/72dpi/banded) against baseline
----------------------------------------------------------------------
Traceback (most recent call last):
  File "/home/regression/regression/gstestgs.py", line 158, in runTest
    self.assertEqual(sum, gssum.get_sum(file), 'md5sum did not match baseline (' + file + ') for file: ' + self.file)
  File "/home/regression/regression/gssum.py", line 43, in get_sum
    sum = db[file]
KeyError: tiger.eps.pkmraw.72.1
======================================================================
ERROR: Checking tiger.eps (pkmraw/300dpi/noband) against baseline
----------------------------------------------------------------------
Traceback (most recent call last):
  File "/home/regression/regression/gstestgs.py", line 158, in runTest
    self.assertEqual(sum, gssum.get_sum(file), 'md5sum did not match baseline (' + file + ') for file: ' + self.file)
  File "/home/regression/regression/gssum.py", line 43, in get_sum
    sum = db[file]
KeyError: tiger.eps.pkmraw.300.0
======================================================================
ERROR: Checking tiger.eps (pkmraw/300dpi/banded) against baseline
----------------------------------------------------------------------
Traceback (most recent call last):
  File "/home/regression/regression/gstestgs.py", line 158, in runTest
    self.assertEqual(sum, gssum.get_sum(file), 'md5sum did not match baseline (' + file + ') for file: ' + self.file)
  File "/home/regression/regression/gssum.py", line 43, in get_sum
    sum = db[file]
KeyError: tiger.eps.pkmraw.300.1
======================================================================
ERROR: Checking vasarely.ps (pbmraw/72dpi/noband) against baseline
----------------------------------------------------------------------
Traceback (most recent call last):
  File "/home/regression/regression/gstestgs.py", line 158, in runTest
    self.assertEqual(sum, gssum.get_sum(file), 'md5sum did not match baseline (' + file + ') for file: ' + self.file)
  File "/home/regression/regression/gssum.py", line 43, in get_sum
    sum = db[file]
KeyError: vasarely.ps.pbmraw.72.0
======================================================================
ERROR: Checking vasarely.ps (pbmraw/72dpi/banded) against baseline
----------------------------------------------------------------------
Traceback (most recent call last):
  File "/home/regression/regression/gstestgs.py", line 158, in runTest
    self.assertEqual(sum, gssum.get_sum(file), 'md5sum did not match baseline (' + file + ') for file: ' + self.file)
  File "/home/regression/regression/gssum.py", line 43, in get_sum
    sum = db[file]
KeyError: vasarely.ps.pbmraw.72.1
======================================================================
ERROR: Checking vasarely.ps (pbmraw/300dpi/noband) against baseline
----------------------------------------------------------------------
Traceback (most recent call last):
  File "/home/regression/regression/gstestgs.py", line 158, in runTest
    self.assertEqual(sum, gssum.get_sum(file), 'md5sum did not match baseline (' + file + ') for file: ' + self.file)
  File "/home/regression/regression/gssum.py", line 43, in get_sum
    sum = db[file]
KeyError: vasarely.ps.pbmraw.300.0
======================================================================
ERROR: Checking vasarely.ps (pbmraw/300dpi/banded) against baseline
----------------------------------------------------------------------
Traceback (most recent call last):
  File "/home/regression/regression/gstestgs.py", line 158, in runTest
    self.assertEqual(sum, gssum.get_sum(file), 'md5sum did not match baseline (' + file + ') for file: ' + self.file)
  File "/home/regression/regression/gssum.py", line 43, in get_sum
    sum = db[file]
KeyError: vasarely.ps.pbmraw.300.1
======================================================================
ERROR: Checking vasarely.ps (pgmraw/72dpi/noband) against baseline
----------------------------------------------------------------------
Traceback (most recent call last):
  File "/home/regression/regression/gstestgs.py", line 158, in runTest
    self.assertEqual(sum, gssum.get_sum(file), 'md5sum did not match baseline (' + file + ') for file: ' + self.file)
  File "/home/regression/regression/gssum.py", line 43, in get_sum
    sum = db[file]
KeyError: vasarely.ps.pgmraw.72.0
======================================================================
ERROR: Checking vasarely.ps (pgmraw/72dpi/banded) against baseline
----------------------------------------------------------------------
Traceback (most recent call last):
  File "/home/regression/regression/gstestgs.py", line 158, in runTest
    self.assertEqual(sum, gssum.get_sum(file), 'md5sum did not match baseline (' + file + ') for file: ' + self.file)
  File "/home/regression/regression/gssum.py", line 43, in get_sum
    sum = db[file]
KeyError: vasarely.ps.pgmraw.72.1
======================================================================
ERROR: Checking vasarely.ps (pgmraw/300dpi/noband) against baseline
----------------------------------------------------------------------
Traceback (most recent call last):
  File "/home/regression/regression/gstestgs.py", line 158, in runTest
    self.assertEqual(sum, gssum.get_sum(file), 'md5sum did not match baseline (' + file + ') for file: ' + self.file)
  File "/home/regression/regression/gssum.py", line 43, in get_sum
    sum = db[file]
KeyError: vasarely.ps.pgmraw.300.0
======================================================================
ERROR: Checking vasarely.ps (pgmraw/300dpi/banded) against baseline
----------------------------------------------------------------------
Traceback (most recent call last):
  File "/home/regression/regression/gstestgs.py", line 158, in runTest
    self.assertEqual(sum, gssum.get_sum(file), 'md5sum did not match baseline (' + file + ') for file: ' + self.file)
  File "/home/regression/regression/gssum.py", line 43, in get_sum
    sum = db[file]
KeyError: vasarely.ps.pgmraw.300.1
======================================================================
ERROR: Checking vasarely.ps (ppmraw/72dpi/noband) against baseline
----------------------------------------------------------------------
Traceback (most recent call last):
  File "/home/regression/regression/gstestgs.py", line 158, in runTest
    self.assertEqual(sum, gssum.get_sum(file), 'md5sum did not match baseline (' + file + ') for file: ' + self.file)
  File "/home/regression/regression/gssum.py", line 43, in get_sum
    sum = db[file]
KeyError: vasarely.ps.ppmraw.72.0
======================================================================
ERROR: Checking vasarely.ps (ppmraw/72dpi/banded) against baseline
----------------------------------------------------------------------
Traceback (most recent call last):
  File "/home/regression/regression/gstestgs.py", line 158, in runTest
    self.assertEqual(sum, gssum.get_sum(file), 'md5sum did not match baseline (' + file + ') for file: ' + self.file)
  File "/home/regression/regression/gssum.py", line 43, in get_sum
    sum = db[file]
KeyError: vasarely.ps.ppmraw.72.1
======================================================================
ERROR: Checking vasarely.ps (ppmraw/300dpi/noband) against baseline
----------------------------------------------------------------------
Traceback (most recent call last):
  File "/home/regression/regression/gstestgs.py", line 158, in runTest
    self.assertEqual(sum, gssum.get_sum(file), 'md5sum did not match baseline (' + file + ') for file: ' + self.file)
  File "/home/regression/regression/gssum.py", line 43, in get_sum
    sum = db[file]
KeyError: vasarely.ps.ppmraw.300.0
======================================================================
ERROR: Checking vasarely.ps (ppmraw/300dpi/banded) against baseline
----------------------------------------------------------------------
Traceback (most recent call last):
  File "/home/regression/regression/gstestgs.py", line 158, in runTest
    self.assertEqual(sum, gssum.get_sum(file), 'md5sum did not match baseline (' + file + ') for file: ' + self.file)
  File "/home/regression/regression/gssum.py", line 43, in get_sum
    sum = db[file]
KeyError: vasarely.ps.ppmraw.300.1
======================================================================
ERROR: Checking vasarely.ps (pkmraw/72dpi/noband) against baseline
----------------------------------------------------------------------
Traceback (most recent call last):
  File "/home/regression/regression/gstestgs.py", line 158, in runTest
    self.assertEqual(sum, gssum.get_sum(file), 'md5sum did not match baseline (' + file + ') for file: ' + self.file)
  File "/home/regression/regression/gssum.py", line 43, in get_sum
    sum = db[file]
KeyError: vasarely.ps.pkmraw.72.0
======================================================================
ERROR: Checking vasarely.ps (pkmraw/72dpi/banded) against baseline
----------------------------------------------------------------------
Traceback (most recent call last):
  File "/home/regression/regression/gstestgs.py", line 158, in runTest
    self.assertEqual(sum, gssum.get_sum(file), 'md5sum did not match baseline (' + file + ') for file: ' + self.file)
  File "/home/regression/regression/gssum.py", line 43, in get_sum
    sum = db[file]
KeyError: vasarely.ps.pkmraw.72.1
======================================================================
ERROR: Checking vasarely.ps (pkmraw/300dpi/noband) against baseline
----------------------------------------------------------------------
Traceback (most recent call last):
  File "/home/regression/regression/gstestgs.py", line 158, in runTest
    self.assertEqual(sum, gssum.get_sum(file), 'md5sum did not match baseline (' + file + ') for file: ' + self.file)
  File "/home/regression/regression/gssum.py", line 43, in get_sum
    sum = db[file]
KeyError: vasarely.ps.pkmraw.300.0
======================================================================
ERROR: Checking vasarely.ps (pkmraw/300dpi/banded) against baseline
----------------------------------------------------------------------
Traceback (most recent call last):
  File "/home/regression/regression/gstestgs.py", line 158, in runTest
    self.assertEqual(sum, gssum.get_sum(file), 'md5sum did not match baseline (' + file + ') for file: ' + self.file)
  File "/home/regression/regression/gssum.py", line 43, in get_sum
    sum = db[file]
KeyError: vasarely.ps.pkmraw.300.1
======================================================================
ERROR: Checking waterfal.ps (pbmraw/72dpi/noband) against baseline
----------------------------------------------------------------------
Traceback (most recent call last):
  File "/home/regression/regression/gstestgs.py", line 158, in runTest
    self.assertEqual(sum, gssum.get_sum(file), 'md5sum did not match baseline (' + file + ') for file: ' + self.file)
  File "/home/regression/regression/gssum.py", line 43, in get_sum
    sum = db[file]
KeyError: waterfal.ps.pbmraw.72.0
======================================================================
ERROR: Checking waterfal.ps (pbmraw/72dpi/banded) against baseline
----------------------------------------------------------------------
Traceback (most recent call last):
  File "/home/regression/regression/gstestgs.py", line 158, in runTest
    self.assertEqual(sum, gssum.get_sum(file), 'md5sum did not match baseline (' + file + ') for file: ' + self.file)
  File "/home/regression/regression/gssum.py", line 43, in get_sum
    sum = db[file]
KeyError: waterfal.ps.pbmraw.72.1
======================================================================
ERROR: Checking waterfal.ps (pbmraw/300dpi/noband) against baseline
----------------------------------------------------------------------
Traceback (most recent call last):
  File "/home/regression/regression/gstestgs.py", line 158, in runTest
    self.assertEqual(sum, gssum.get_sum(file), 'md5sum did not match baseline (' + file + ') for file: ' + self.file)
  File "/home/regression/regression/gssum.py", line 43, in get_sum
    sum = db[file]
KeyError: waterfal.ps.pbmraw.300.0
======================================================================
ERROR: Checking waterfal.ps (pbmraw/300dpi/banded) against baseline
----------------------------------------------------------------------
Traceback (most recent call last):
  File "/home/regression/regression/gstestgs.py", line 158, in runTest
    self.assertEqual(sum, gssum.get_sum(file), 'md5sum did not match baseline (' + file + ') for file: ' + self.file)
  File "/home/regression/regression/gssum.py", line 43, in get_sum
    sum = db[file]
KeyError: waterfal.ps.pbmraw.300.1
======================================================================
ERROR: Checking waterfal.ps (pgmraw/72dpi/noband) against baseline
----------------------------------------------------------------------
Traceback (most recent call last):
  File "/home/regression/regression/gstestgs.py", line 158, in runTest
    self.assertEqual(sum, gssum.get_sum(file), 'md5sum did not match baseline (' + file + ') for file: ' + self.file)
  File "/home/regression/regression/gssum.py", line 43, in get_sum
    sum = db[file]
KeyError: waterfal.ps.pgmraw.72.0
======================================================================
ERROR: Checking waterfal.ps (pgmraw/72dpi/banded) against baseline
----------------------------------------------------------------------
Traceback (most recent call last):
  File "/home/regression/regression/gstestgs.py", line 158, in runTest
    self.assertEqual(sum, gssum.get_sum(file), 'md5sum did not match baseline (' + file + ') for file: ' + self.file)
  File "/home/regression/regression/gssum.py", line 43, in get_sum
    sum = db[file]
KeyError: waterfal.ps.pgmraw.72.1
======================================================================
ERROR: Checking waterfal.ps (pgmraw/300dpi/noband) against baseline
----------------------------------------------------------------------
Traceback (most recent call last):
  File "/home/regression/regression/gstestgs.py", line 158, in runTest
    self.assertEqual(sum, gssum.get_sum(file), 'md5sum did not match baseline (' + file + ') for file: ' + self.file)
  File "/home/regression/regression/gssum.py", line 43, in get_sum
    sum = db[file]
KeyError: waterfal.ps.pgmraw.300.0
======================================================================
ERROR: Checking waterfal.ps (pgmraw/300dpi/banded) against baseline
----------------------------------------------------------------------
Traceback (most recent call last):
  File "/home/regression/regression/gstestgs.py", line 158, in runTest
    self.assertEqual(sum, gssum.get_sum(file), 'md5sum did not match baseline (' + file + ') for file: ' + self.file)
  File "/home/regression/regression/gssum.py", line 43, in get_sum
    sum = db[file]
KeyError: waterfal.ps.pgmraw.300.1
======================================================================
ERROR: Checking waterfal.ps (ppmraw/72dpi/noband) against baseline
----------------------------------------------------------------------
Traceback (most recent call last):
  File "/home/regression/regression/gstestgs.py", line 158, in runTest
    self.assertEqual(sum, gssum.get_sum(file), 'md5sum did not match baseline (' + file + ') for file: ' + self.file)
  File "/home/regression/regression/gssum.py", line 43, in get_sum
    sum = db[file]
KeyError: waterfal.ps.ppmraw.72.0
======================================================================
ERROR: Checking waterfal.ps (ppmraw/72dpi/banded) against baseline
----------------------------------------------------------------------
Traceback (most recent call last):
  File "/home/regression/regression/gstestgs.py", line 158, in runTest
    self.assertEqual(sum, gssum.get_sum(file), 'md5sum did not match baseline (' + file + ') for file: ' + self.file)
  File "/home/regression/regression/gssum.py", line 43, in get_sum
    sum = db[file]
KeyError: waterfal.ps.ppmraw.72.1
======================================================================
ERROR: Checking waterfal.ps (ppmraw/300dpi/noband) against baseline
----------------------------------------------------------------------
Traceback (most recent call last):
  File "/home/regression/regression/gstestgs.py", line 158, in runTest
    self.assertEqual(sum, gssum.get_sum(file), 'md5sum did not match baseline (' + file + ') for file: ' + self.file)
  File "/home/regression/regression/gssum.py", line 43, in get_sum
    sum = db[file]
KeyError: waterfal.ps.ppmraw.300.0
======================================================================
ERROR: Checking waterfal.ps (ppmraw/300dpi/banded) against baseline
----------------------------------------------------------------------
Traceback (most recent call last):
  File "/home/regression/regression/gstestgs.py", line 158, in runTest
    self.assertEqual(sum, gssum.get_sum(file), 'md5sum did not match baseline (' + file + ') for file: ' + self.file)
  File "/home/regression/regression/gssum.py", line 43, in get_sum
    sum = db[file]
KeyError: waterfal.ps.ppmraw.300.1
======================================================================
ERROR: Checking waterfal.ps (pkmraw/72dpi/noband) against baseline
----------------------------------------------------------------------
Traceback (most recent call last):
  File "/home/regression/regression/gstestgs.py", line 158, in runTest
    self.assertEqual(sum, gssum.get_sum(file), 'md5sum did not match baseline (' + file + ') for file: ' + self.file)
  File "/home/regression/regression/gssum.py", line 43, in get_sum
    sum = db[file]
KeyError: waterfal.ps.pkmraw.72.0
======================================================================
ERROR: Checking waterfal.ps (pkmraw/72dpi/banded) against baseline
----------------------------------------------------------------------
Traceback (most recent call last):
  File "/home/regression/regression/gstestgs.py", line 158, in runTest
    self.assertEqual(sum, gssum.get_sum(file), 'md5sum did not match baseline (' + file + ') for file: ' + self.file)
  File "/home/regression/regression/gssum.py", line 43, in get_sum
    sum = db[file]
KeyError: waterfal.ps.pkmraw.72.1
======================================================================
ERROR: Checking waterfal.ps (pkmraw/300dpi/noband) against baseline
----------------------------------------------------------------------
Traceback (most recent call last):
  File "/home/regression/regression/gstestgs.py", line 158, in runTest
    self.assertEqual(sum, gssum.get_sum(file), 'md5sum did not match baseline (' + file + ') for file: ' + self.file)
  File "/home/regression/regression/gssum.py", line 43, in get_sum
    sum = db[file]
KeyError: waterfal.ps.pkmraw.300.0
======================================================================
ERROR: Checking waterfal.ps (pkmraw/300dpi/banded) against baseline
----------------------------------------------------------------------
Traceback (most recent call last):
  File "/home/regression/regression/gstestgs.py", line 158, in runTest
    self.assertEqual(sum, gssum.get_sum(file), 'md5sum did not match baseline (' + file + ') for file: ' + self.file)
  File "/home/regression/regression/gssum.py", line 43, in get_sum
    sum = db[file]
KeyError: waterfal.ps.pkmraw.300.1
======================================================================
ERROR: Checking pdfwrite of Altona-Testsuite_p2_S_x3.pdf (ppmraw/72dpi/noband) against baseline
----------------------------------------------------------------------
Traceback (most recent call last):
  File "/home/regression/regression/gscheck_pdfwrite.py", line 79, in runTest
    self.assertEqual(sum, gssum.get_sum(file2), "md5sum did not match baseline (" + file2 + ") for file: " + self.file)
  File "/home/regression/regression/gssum.py", line 43, in get_sum
    sum = db[file]
KeyError: Altona-Testsuite_p2_S_x3.pdf.pdf.ppmraw.72.0
======================================================================
ERROR: Checking pdfwrite of Altona-Testsuite_p2_S_x3.pdf (ppmraw/300dpi/noband) against baseline
----------------------------------------------------------------------
Traceback (most recent call last):
  File "/home/regression/regression/gscheck_pdfwrite.py", line 79, in runTest
    self.assertEqual(sum, gssum.get_sum(file2), "md5sum did not match baseline (" + file2 + ") for file: " + self.file)
  File "/home/regression/regression/gssum.py", line 43, in get_sum
    sum = db[file]
KeyError: Altona-Testsuite_p2_S_x3.pdf.pdf.ppmraw.300.0
======================================================================
ERROR: Checking pdfwrite of Altona-Testsuite_p2_S_x3.pdf (pkmraw/300dpi/noband) against baseline
----------------------------------------------------------------------
Traceback (most recent call last):
  File "/home/regression/regression/gscheck_pdfwrite.py", line 79, in runTest
    self.assertEqual(sum, gssum.get_sum(file2), "md5sum did not match baseline (" + file2 + ") for file: " + self.file)
  File "/home/regression/regression/gssum.py", line 43, in get_sum
    sum = db[file]
KeyError: Altona-Testsuite_p2_S_x3.pdf.pdf.pkmraw.300.0
======================================================================
ERROR: Checking pdfwrite of Altona.Page_3.2002-09-27.pdf (ppmraw/72dpi/noband) against baseline
----------------------------------------------------------------------
Traceback (most recent call last):
  File "/home/regression/regression/gscheck_pdfwrite.py", line 79, in runTest
    self.assertEqual(sum, gssum.get_sum(file2), "md5sum did not match baseline (" + file2 + ") for file: " + self.file)
  File "/home/regression/regression/gssum.py", line 43, in get_sum
    sum = db[file]
KeyError: Altona.Page_3.2002-09-27.pdf.pdf.ppmraw.72.0
======================================================================
ERROR: Checking pdfwrite of Altona.Page_3.2002-09-27.pdf (ppmraw/300dpi/noband) against baseline
----------------------------------------------------------------------
Traceback (most recent call last):
  File "/home/regression/regression/gscheck_pdfwrite.py", line 79, in runTest
    self.assertEqual(sum, gssum.get_sum(file2), "md5sum did not match baseline (" + file2 + ") for file: " + self.file)
  File "/home/regression/regression/gssum.py", line 43, in get_sum
    sum = db[file]
KeyError: Altona.Page_3.2002-09-27.pdf.pdf.ppmraw.300.0
======================================================================
ERROR: Checking pdfwrite of Altona.Page_3.2002-09-27.pdf (pkmraw/300dpi/noband) against baseline
----------------------------------------------------------------------
Traceback (most recent call last):
  File "/home/regression/regression/gscheck_pdfwrite.py", line 79, in runTest
    self.assertEqual(sum, gssum.get_sum(file2), "md5sum did not match baseline (" + file2 + ") for file: " + self.file)
  File "/home/regression/regression/gssum.py", line 43, in get_sum
    sum = db[file]
KeyError: Altona.Page_3.2002-09-27.pdf.pdf.pkmraw.300.0
======================================================================
ERROR: Checking pdfwrite of S2_Digitalproof-Forum_circles.pdf (ppmraw/72dpi/noband) against baseline
----------------------------------------------------------------------
Traceback (most recent call last):
  File "/home/regression/regression/gscheck_pdfwrite.py", line 79, in runTest
    self.assertEqual(sum, gssum.get_sum(file2), "md5sum did not match baseline (" + file2 + ") for file: " + self.file)
  File "/home/regression/regression/gssum.py", line 43, in get_sum
    sum = db[file]
KeyError: S2_Digitalproof-Forum_circles.pdf.pdf.ppmraw.72.0
======================================================================
ERROR: Checking pdfwrite of S2_Digitalproof-Forum_circles.pdf (ppmraw/300dpi/noband) against baseline
----------------------------------------------------------------------
Traceback (most recent call last):
  File "/home/regression/regression/gscheck_pdfwrite.py", line 79, in runTest
    self.assertEqual(sum, gssum.get_sum(file2), "md5sum did not match baseline (" + file2 + ") for file: " + self.file)
  File "/home/regression/regression/gssum.py", line 43, in get_sum
    sum = db[file]
KeyError: S2_Digitalproof-Forum_circles.pdf.pdf.ppmraw.300.0
======================================================================
ERROR: Checking pdfwrite of S2_Digitalproof-Forum_circles.pdf (pkmraw/300dpi/noband) against baseline
----------------------------------------------------------------------
Traceback (most recent call last):
  File "/home/regression/regression/gscheck_pdfwrite.py", line 79, in runTest
    self.assertEqual(sum, gssum.get_sum(file2), "md5sum did not match baseline (" + file2 + ") for file: " + self.file)
  File "/home/regression/regression/gssum.py", line 43, in get_sum
    sum = db[file]
KeyError: S2_Digitalproof-Forum_circles.pdf.pdf.pkmraw.300.0
======================================================================
ERROR: Checking pdfwrite of S2_Digitalproof-Forum_x3k.pdf (ppmraw/72dpi/noband) against baseline
----------------------------------------------------------------------
Traceback (most recent call last):
  File "/home/regression/regression/gscheck_pdfwrite.py", line 79, in runTest
    self.assertEqual(sum, gssum.get_sum(file2), "md5sum did not match baseline (" + file2 + ") for file: " + self.file)
  File "/home/regression/regression/gssum.py", line 43, in get_sum
    sum = db[file]
KeyError: S2_Digitalproof-Forum_x3k.pdf.pdf.ppmraw.72.0
======================================================================
ERROR: Checking pdfwrite of S2_Digitalproof-Forum_x3k.pdf (ppmraw/300dpi/noband) against baseline
----------------------------------------------------------------------
Traceback (most recent call last):
  File "/home/regression/regression/gscheck_pdfwrite.py", line 79, in runTest
    self.assertEqual(sum, gssum.get_sum(file2), "md5sum did not match baseline (" + file2 + ") for file: " + self.file)
  File "/home/regression/regression/gssum.py", line 43, in get_sum
    sum = db[file]
KeyError: S2_Digitalproof-Forum_x3k.pdf.pdf.ppmraw.300.0
======================================================================
ERROR: Checking pdfwrite of S2_Digitalproof-Forum_x3k.pdf (pkmraw/300dpi/noband) against baseline
----------------------------------------------------------------------
Traceback (most recent call last):
  File "/home/regression/regression/gscheck_pdfwrite.py", line 79, in runTest
    self.assertEqual(sum, gssum.get_sum(file2), "md5sum did not match baseline (" + file2 + ") for file: " + self.file)
  File "/home/regression/regression/gssum.py", line 43, in get_sum
    sum = db[file]
KeyError: S2_Digitalproof-Forum_x3k.pdf.pdf.pkmraw.300.0
======================================================================
ERROR: Checking pdfwrite of Testform.v1.0.2.pdf (ppmraw/72dpi/noband) against baseline
----------------------------------------------------------------------
Traceback (most recent call last):
  File "/home/regression/regression/gscheck_pdfwrite.py", line 79, in runTest
    self.assertEqual(sum, gssum.get_sum(file2), "md5sum did not match baseline (" + file2 + ") for file: " + self.file)
  File "/home/regression/regression/gssum.py", line 43, in get_sum
    sum = db[file]
KeyError: Testform.v1.0.2.pdf.pdf.ppmraw.72.0
======================================================================
ERROR: Checking pdfwrite of Testform.v1.0.2.pdf (ppmraw/300dpi/noband) against baseline
----------------------------------------------------------------------
Traceback (most recent call last):
  File "/home/regression/regression/gscheck_pdfwrite.py", line 79, in runTest
    self.assertEqual(sum, gssum.get_sum(file2), "md5sum did not match baseline (" + file2 + ") for file: " + self.file)
  File "/home/regression/regression/gssum.py", line 43, in get_sum
    sum = db[file]
KeyError: Testform.v1.0.2.pdf.pdf.ppmraw.300.0
======================================================================
ERROR: Checking pdfwrite of Testform.v1.0.2.pdf (pkmraw/300dpi/noband) against baseline
----------------------------------------------------------------------
Traceback (most recent call last):
  File "/home/regression/regression/gscheck_pdfwrite.py", line 79, in runTest
    self.assertEqual(sum, gssum.get_sum(file2), "md5sum did not match baseline (" + file2 + ") for file: " + self.file)
  File "/home/regression/regression/gssum.py", line 43, in get_sum
    sum = db[file]
KeyError: Testform.v1.0.2.pdf.pdf.pkmraw.300.0
======================================================================
ERROR: Checking pdfwrite of Es001-01.pdf (ppmraw/72dpi/noband) against baseline
----------------------------------------------------------------------
Traceback (most recent call last):
  File "/home/regression/regression/gscheck_pdfwrite.py", line 79, in runTest
    self.assertEqual(sum, gssum.get_sum(file2), "md5sum did not match baseline (" + file2 + ") for file: " + self.file)
  File "/home/regression/regression/gssum.py", line 43, in get_sum
    sum = db[file]
KeyError: Es001-01.pdf.pdf.ppmraw.72.0
======================================================================
ERROR: Checking pdfwrite of Es001-01.pdf (ppmraw/300dpi/noband) against baseline
----------------------------------------------------------------------
Traceback (most recent call last):
  File "/home/regression/regression/gscheck_pdfwrite.py", line 79, in runTest
    self.assertEqual(sum, gssum.get_sum(file2), "md5sum did not match baseline (" + file2 + ") for file: " + self.file)
  File "/home/regression/regression/gssum.py", line 43, in get_sum
    sum = db[file]
KeyError: Es001-01.pdf.pdf.ppmraw.300.0
======================================================================
ERROR: Checking pdfwrite of Es001-01.pdf (pkmraw/300dpi/noband) against baseline
----------------------------------------------------------------------
Traceback (most recent call last):
  File "/home/regression/regression/gscheck_pdfwrite.py", line 79, in runTest
    self.assertEqual(sum, gssum.get_sum(file2), "md5sum did not match baseline (" + file2 + ") for file: " + self.file)
  File "/home/regression/regression/gssum.py", line 43, in get_sum
    sum = db[file]
KeyError: Es001-01.pdf.pdf.pkmraw.300.0
======================================================================
ERROR: Checking pdfwrite of annots.pdf (ppmraw/72dpi/noband) against baseline
----------------------------------------------------------------------
Traceback (most recent call last):
  File "/home/regression/regression/gscheck_pdfwrite.py", line 79, in runTest
    self.assertEqual(sum, gssum.get_sum(file2), "md5sum did not match baseline (" + file2 + ") for file: " + self.file)
  File "/home/regression/regression/gssum.py", line 43, in get_sum
    sum = db[file]
KeyError: annots.pdf.pdf.ppmraw.72.0
======================================================================
ERROR: Checking pdfwrite of annots.pdf (ppmraw/300dpi/noband) against baseline
----------------------------------------------------------------------
Traceback (most recent call last):
  File "/home/regression/regression/gscheck_pdfwrite.py", line 79, in runTest
    self.assertEqual(sum, gssum.get_sum(file2), "md5sum did not match baseline (" + file2 + ") for file: " + self.file)
  File "/home/regression/regression/gssum.py", line 43, in get_sum
    sum = db[file]
KeyError: annots.pdf.pdf.ppmraw.300.0
======================================================================
ERROR: Checking pdfwrite of annots.pdf (pkmraw/300dpi/noband) against baseline
----------------------------------------------------------------------
Traceback (most recent call last):
  File "/home/regression/regression/gscheck_pdfwrite.py", line 79, in runTest
    self.assertEqual(sum, gssum.get_sum(file2), "md5sum did not match baseline (" + file2 + ") for file: " + self.file)
  File "/home/regression/regression/gssum.py", line 43, in get_sum
    sum = db[file]
KeyError: annots.pdf.pdf.pkmraw.300.0
======================================================================
ERROR: Checking pdfwrite of alphabet.ps (ppmraw/72dpi/noband) against baseline
----------------------------------------------------------------------
Traceback (most recent call last):
  File "/home/regression/regression/gscheck_pdfwrite.py", line 79, in runTest
    self.assertEqual(sum, gssum.get_sum(file2), "md5sum did not match baseline (" + file2 + ") for file: " + self.file)
  File "/home/regression/regression/gssum.py", line 43, in get_sum
    sum = db[file]
KeyError: alphabet.ps.pdf.ppmraw.72.0
======================================================================
ERROR: Checking pdfwrite of alphabet.ps (ppmraw/300dpi/noband) against baseline
----------------------------------------------------------------------
Traceback (most recent call last):
  File "/home/regression/regression/gscheck_pdfwrite.py", line 79, in runTest
    self.assertEqual(sum, gssum.get_sum(file2), "md5sum did not match baseline (" + file2 + ") for file: " + self.file)
  File "/home/regression/regression/gssum.py", line 43, in get_sum
    sum = db[file]
KeyError: alphabet.ps.pdf.ppmraw.300.0
======================================================================
ERROR: Checking pdfwrite of alphabet.ps (pkmraw/300dpi/noband) against baseline
----------------------------------------------------------------------
Traceback (most recent call last):
  File "/home/regression/regression/gscheck_pdfwrite.py", line 79, in runTest
    self.assertEqual(sum, gssum.get_sum(file2), "md5sum did not match baseline (" + file2 + ") for file: " + self.file)
  File "/home/regression/regression/gssum.py", line 43, in get_sum
    sum = db[file]
KeyError: alphabet.ps.pdf.pkmraw.300.0
======================================================================
ERROR: Checking pdfwrite of chess.ps (ppmraw/72dpi/noband) against baseline
----------------------------------------------------------------------
Traceback (most recent call last):
  File "/home/regression/regression/gscheck_pdfwrite.py", line 79, in runTest
    self.assertEqual(sum, gssum.get_sum(file2), "md5sum did not match baseline (" + file2 + ") for file: " + self.file)
  File "/home/regression/regression/gssum.py", line 43, in get_sum
    sum = db[file]
KeyError: chess.ps.pdf.ppmraw.72.0
======================================================================
ERROR: Checking pdfwrite of chess.ps (ppmraw/300dpi/noband) against baseline
----------------------------------------------------------------------
Traceback (most recent call last):
  File "/home/regression/regression/gscheck_pdfwrite.py", line 79, in runTest
    self.assertEqual(sum, gssum.get_sum(file2), "md5sum did not match baseline (" + file2 + ") for file: " + self.file)
  File "/home/regression/regression/gssum.py", line 43, in get_sum
    sum = db[file]
KeyError: chess.ps.pdf.ppmraw.300.0
======================================================================
ERROR: Checking pdfwrite of chess.ps (pkmraw/300dpi/noband) against baseline
----------------------------------------------------------------------
Traceback (most recent call last):
  File "/home/regression/regression/gscheck_pdfwrite.py", line 79, in runTest
    self.assertEqual(sum, gssum.get_sum(file2), "md5sum did not match baseline (" + file2 + ") for file: " + self.file)
  File "/home/regression/regression/gssum.py", line 43, in get_sum
    sum = db[file]
KeyError: chess.ps.pdf.pkmraw.300.0
======================================================================
ERROR: Checking pdfwrite of colorcir.ps (ppmraw/72dpi/noband) against baseline
----------------------------------------------------------------------
Traceback (most recent call last):
  File "/home/regression/regression/gscheck_pdfwrite.py", line 79, in runTest
    self.assertEqual(sum, gssum.get_sum(file2), "md5sum did not match baseline (" + file2 + ") for file: " + self.file)
  File "/home/regression/regression/gssum.py", line 43, in get_sum
    sum = db[file]
KeyError: colorcir.ps.pdf.ppmraw.72.0
======================================================================
ERROR: Checking pdfwrite of colorcir.ps (ppmraw/300dpi/noband) against baseline
----------------------------------------------------------------------
Traceback (most recent call last):
  File "/home/regression/regression/gscheck_pdfwrite.py", line 79, in runTest
    self.assertEqual(sum, gssum.get_sum(file2), "md5sum did not match baseline (" + file2 + ") for file: " + self.file)
  File "/home/regression/regression/gssum.py", line 43, in get_sum
    sum = db[file]
KeyError: colorcir.ps.pdf.ppmraw.300.0
======================================================================
ERROR: Checking pdfwrite of colorcir.ps (pkmraw/300dpi/noband) against baseline
----------------------------------------------------------------------
Traceback (most recent call last):
  File "/home/regression/regression/gscheck_pdfwrite.py", line 79, in runTest
    self.assertEqual(sum, gssum.get_sum(file2), "md5sum did not match baseline (" + file2 + ") for file: " + self.file)
  File "/home/regression/regression/gssum.py", line 43, in get_sum
    sum = db[file]
KeyError: colorcir.ps.pdf.pkmraw.300.0
======================================================================
ERROR: Checking pdfwrite of doretree.ps (ppmraw/72dpi/noband) against baseline
----------------------------------------------------------------------
Traceback (most recent call last):
  File "/home/regression/regression/gscheck_pdfwrite.py", line 79, in runTest
    self.assertEqual(sum, gssum.get_sum(file2), "md5sum did not match baseline (" + file2 + ") for file: " + self.file)
  File "/home/regression/regression/gssum.py", line 43, in get_sum
    sum = db[file]
KeyError: doretree.ps.pdf.ppmraw.72.0
======================================================================
ERROR: Checking pdfwrite of doretree.ps (ppmraw/300dpi/noband) against baseline
----------------------------------------------------------------------
Traceback (most recent call last):
  File "/home/regression/regression/gscheck_pdfwrite.py", line 79, in runTest
    self.assertEqual(sum, gssum.get_sum(file2), "md5sum did not match baseline (" + file2 + ") for file: " + self.file)
  File "/home/regression/regression/gssum.py", line 43, in get_sum
    sum = db[file]
KeyError: doretree.ps.pdf.ppmraw.300.0
======================================================================
ERROR: Checking pdfwrite of doretree.ps (pkmraw/300dpi/noband) against baseline
----------------------------------------------------------------------
Traceback (most recent call last):
  File "/home/regression/regression/gscheck_pdfwrite.py", line 79, in runTest
    self.assertEqual(sum, gssum.get_sum(file2), "md5sum did not match baseline (" + file2 + ") for file: " + self.file)
  File "/home/regression/regression/gssum.py", line 43, in get_sum
    sum = db[file]
KeyError: doretree.ps.pdf.pkmraw.300.0
======================================================================
ERROR: Checking pdfwrite of escher.ps (ppmraw/72dpi/noband) against baseline
----------------------------------------------------------------------
Traceback (most recent call last):
  File "/home/regression/regression/gscheck_pdfwrite.py", line 79, in runTest
    self.assertEqual(sum, gssum.get_sum(file2), "md5sum did not match baseline (" + file2 + ") for file: " + self.file)
  File "/home/regression/regression/gssum.py", line 43, in get_sum
    sum = db[file]
KeyError: escher.ps.pdf.ppmraw.72.0
======================================================================
ERROR: Checking pdfwrite of escher.ps (ppmraw/300dpi/noband) against baseline
----------------------------------------------------------------------
Traceback (most recent call last):
  File "/home/regression/regression/gscheck_pdfwrite.py", line 79, in runTest
    self.assertEqual(sum, gssum.get_sum(file2), "md5sum did not match baseline (" + file2 + ") for file: " + self.file)
  File "/home/regression/regression/gssum.py", line 43, in get_sum
    sum = db[file]
KeyError: escher.ps.pdf.ppmraw.300.0
======================================================================
ERROR: Checking pdfwrite of escher.ps (pkmraw/300dpi/noband) against baseline
----------------------------------------------------------------------
Traceback (most recent call last):
  File "/home/regression/regression/gscheck_pdfwrite.py", line 79, in runTest
    self.assertEqual(sum, gssum.get_sum(file2), "md5sum did not match baseline (" + file2 + ") for file: " + self.file)
  File "/home/regression/regression/gssum.py", line 43, in get_sum
    sum = db[file]
KeyError: escher.ps.pdf.pkmraw.300.0
======================================================================
ERROR: Checking pdfwrite of golfer.eps (ppmraw/72dpi/noband) against baseline
----------------------------------------------------------------------
Traceback (most recent call last):
  File "/home/regression/regression/gscheck_pdfwrite.py", line 79, in runTest
    self.assertEqual(sum, gssum.get_sum(file2), "md5sum did not match baseline (" + file2 + ") for file: " + self.file)
  File "/home/regression/regression/gssum.py", line 43, in get_sum
    sum = db[file]
KeyError: golfer.eps.pdf.ppmraw.72.0
======================================================================
ERROR: Checking pdfwrite of golfer.eps (ppmraw/300dpi/noband) against baseline
----------------------------------------------------------------------
Traceback (most recent call last):
  File "/home/regression/regression/gscheck_pdfwrite.py", line 79, in runTest
    self.assertEqual(sum, gssum.get_sum(file2), "md5sum did not match baseline (" + file2 + ") for file: " + self.file)
  File "/home/regression/regression/gssum.py", line 43, in get_sum
    sum = db[file]
KeyError: golfer.eps.pdf.ppmraw.300.0
======================================================================
ERROR: Checking pdfwrite of golfer.eps (pkmraw/300dpi/noband) against baseline
----------------------------------------------------------------------
Traceback (most recent call last):
  File "/home/regression/regression/gscheck_pdfwrite.py", line 79, in runTest
    self.assertEqual(sum, gssum.get_sum(file2), "md5sum did not match baseline (" + file2 + ") for file: " + self.file)
  File "/home/regression/regression/gssum.py", line 43, in get_sum
    sum = db[file]
KeyError: golfer.eps.pdf.pkmraw.300.0
======================================================================
ERROR: Checking pdfwrite of grayalph.ps (ppmraw/72dpi/noband) against baseline
----------------------------------------------------------------------
Traceback (most recent call last):
  File "/home/regression/regression/gscheck_pdfwrite.py", line 79, in runTest
    self.assertEqual(sum, gssum.get_sum(file2), "md5sum did not match baseline (" + file2 + ") for file: " + self.file)
  File "/home/regression/regression/gssum.py", line 43, in get_sum
    sum = db[file]
KeyError: grayalph.ps.pdf.ppmraw.72.0
======================================================================
ERROR: Checking pdfwrite of grayalph.ps (ppmraw/300dpi/noband) against baseline
----------------------------------------------------------------------
Traceback (most recent call last):
  File "/home/regression/regression/gscheck_pdfwrite.py", line 79, in runTest
    self.assertEqual(sum, gssum.get_sum(file2), "md5sum did not match baseline (" + file2 + ") for file: " + self.file)
  File "/home/regression/regression/gssum.py", line 43, in get_sum
    sum = db[file]
KeyError: grayalph.ps.pdf.ppmraw.300.0
======================================================================
ERROR: Checking pdfwrite of grayalph.ps (pkmraw/300dpi/noband) against baseline
----------------------------------------------------------------------
Traceback (most recent call last):
  File "/home/regression/regression/gscheck_pdfwrite.py", line 79, in runTest
    self.assertEqual(sum, gssum.get_sum(file2), "md5sum did not match baseline (" + file2 + ") for file: " + self.file)
  File "/home/regression/regression/gssum.py", line 43, in get_sum
    sum = db[file]
KeyError: grayalph.ps.pdf.pkmraw.300.0
======================================================================
ERROR: Checking pdfwrite of ridt91.eps (ppmraw/72dpi/noband) against baseline
----------------------------------------------------------------------
Traceback (most recent call last):
  File "/home/regression/regression/gscheck_pdfwrite.py", line 79, in runTest
    self.assertEqual(sum, gssum.get_sum(file2), "md5sum did not match baseline (" + file2 + ") for file: " + self.file)
  File "/home/regression/regression/gssum.py", line 43, in get_sum
    sum = db[file]
KeyError: ridt91.eps.pdf.ppmraw.72.0
======================================================================
ERROR: Checking pdfwrite of ridt91.eps (ppmraw/300dpi/noband) against baseline
----------------------------------------------------------------------
Traceback (most recent call last):
  File "/home/regression/regression/gscheck_pdfwrite.py", line 79, in runTest
    self.assertEqual(sum, gssum.get_sum(file2), "md5sum did not match baseline (" + file2 + ") for file: " + self.file)
  File "/home/regression/regression/gssum.py", line 43, in get_sum
    sum = db[file]
KeyError: ridt91.eps.pdf.ppmraw.300.0
======================================================================
ERROR: Checking pdfwrite of ridt91.eps (pkmraw/300dpi/noband) against baseline
----------------------------------------------------------------------
Traceback (most recent call last):
  File "/home/regression/regression/gscheck_pdfwrite.py", line 79, in runTest
    self.assertEqual(sum, gssum.get_sum(file2), "md5sum did not match baseline (" + file2 + ") for file: " + self.file)
  File "/home/regression/regression/gssum.py", line 43, in get_sum
    sum = db[file]
KeyError: ridt91.eps.pdf.pkmraw.300.0
======================================================================
ERROR: Checking pdfwrite of snowflak.ps (ppmraw/72dpi/noband) against baseline
----------------------------------------------------------------------
Traceback (most recent call last):
  File "/home/regression/regression/gscheck_pdfwrite.py", line 79, in runTest
    self.assertEqual(sum, gssum.get_sum(file2), "md5sum did not match baseline (" + file2 + ") for file: " + self.file)
  File "/home/regression/regression/gssum.py", line 43, in get_sum
    sum = db[file]
KeyError: snowflak.ps.pdf.ppmraw.72.0
======================================================================
ERROR: Checking pdfwrite of snowflak.ps (ppmraw/300dpi/noband) against baseline
----------------------------------------------------------------------
Traceback (most recent call last):
  File "/home/regression/regression/gscheck_pdfwrite.py", line 79, in runTest
    self.assertEqual(sum, gssum.get_sum(file2), "md5sum did not match baseline (" + file2 + ") for file: " + self.file)
  File "/home/regression/regression/gssum.py", line 43, in get_sum
    sum = db[file]
KeyError: snowflak.ps.pdf.ppmraw.300.0
======================================================================
ERROR: Checking pdfwrite of snowflak.ps (pkmraw/300dpi/noband) against baseline
----------------------------------------------------------------------
Traceback (most recent call last):
  File "/home/regression/regression/gscheck_pdfwrite.py", line 79, in runTest
    self.assertEqual(sum, gssum.get_sum(file2), "md5sum did not match baseline (" + file2 + ") for file: " + self.file)
  File "/home/regression/regression/gssum.py", line 43, in get_sum
    sum = db[file]
KeyError: snowflak.ps.pdf.pkmraw.300.0
======================================================================
ERROR: Checking pdfwrite of tiger.eps (ppmraw/72dpi/noband) against baseline
----------------------------------------------------------------------
Traceback (most recent call last):
  File "/home/regression/regression/gscheck_pdfwrite.py", line 79, in runTest
    self.assertEqual(sum, gssum.get_sum(file2), "md5sum did not match baseline (" + file2 + ") for file: " + self.file)
  File "/home/regression/regression/gssum.py", line 43, in get_sum
    sum = db[file]
KeyError: tiger.eps.pdf.ppmraw.72.0
======================================================================
ERROR: Checking pdfwrite of tiger.eps (ppmraw/300dpi/noband) against baseline
----------------------------------------------------------------------
Traceback (most recent call last):
  File "/home/regression/regression/gscheck_pdfwrite.py", line 79, in runTest
    self.assertEqual(sum, gssum.get_sum(file2), "md5sum did not match baseline (" + file2 + ") for file: " + self.file)
  File "/home/regression/regression/gssum.py", line 43, in get_sum
    sum = db[file]
KeyError: tiger.eps.pdf.ppmraw.300.0
======================================================================
ERROR: Checking pdfwrite of tiger.eps (pkmraw/300dpi/noband) against baseline
----------------------------------------------------------------------
Traceback (most recent call last):
  File "/home/regression/regression/gscheck_pdfwrite.py", line 79, in runTest
    self.assertEqual(sum, gssum.get_sum(file2), "md5sum did not match baseline (" + file2 + ") for file: " + self.file)
  File "/home/regression/regression/gssum.py", line 43, in get_sum
    sum = db[file]
KeyError: tiger.eps.pdf.pkmraw.300.0
======================================================================
ERROR: Checking pdfwrite of vasarely.ps (ppmraw/72dpi/noband) against baseline
----------------------------------------------------------------------
Traceback (most recent call last):
  File "/home/regression/regression/gscheck_pdfwrite.py", line 79, in runTest
    self.assertEqual(sum, gssum.get_sum(file2), "md5sum did not match baseline (" + file2 + ") for file: " + self.file)
  File "/home/regression/regression/gssum.py", line 43, in get_sum
    sum = db[file]
KeyError: vasarely.ps.pdf.ppmraw.72.0
======================================================================
ERROR: Checking pdfwrite of vasarely.ps (ppmraw/300dpi/noband) against baseline
----------------------------------------------------------------------
Traceback (most recent call last):
  File "/home/regression/regression/gscheck_pdfwrite.py", line 79, in runTest
    self.assertEqual(sum, gssum.get_sum(file2), "md5sum did not match baseline (" + file2 + ") for file: " + self.file)
  File "/home/regression/regression/gssum.py", line 43, in get_sum
    sum = db[file]
KeyError: vasarely.ps.pdf.ppmraw.300.0
======================================================================
ERROR: Checking pdfwrite of vasarely.ps (pkmraw/300dpi/noband) against baseline
----------------------------------------------------------------------
Traceback (most recent call last):
  File "/home/regression/regression/gscheck_pdfwrite.py", line 79, in runTest
    self.assertEqual(sum, gssum.get_sum(file2), "md5sum did not match baseline (" + file2 + ") for file: " + self.file)
  File "/home/regression/regression/gssum.py", line 43, in get_sum
    sum = db[file]
KeyError: vasarely.ps.pdf.pkmraw.300.0
======================================================================
ERROR: Checking pdfwrite of waterfal.ps (ppmraw/72dpi/noband) against baseline
----------------------------------------------------------------------
Traceback (most recent call last):
  File "/home/regression/regression/gscheck_pdfwrite.py", line 79, in runTest
    self.assertEqual(sum, gssum.get_sum(file2), "md5sum did not match baseline (" + file2 + ") for file: " + self.file)
  File "/home/regression/regression/gssum.py", line 43, in get_sum
    sum = db[file]
KeyError: waterfal.ps.pdf.ppmraw.72.0
======================================================================
ERROR: Checking pdfwrite of waterfal.ps (ppmraw/300dpi/noband) against baseline
----------------------------------------------------------------------
Traceback (most recent call last):
  File "/home/regression/regression/gscheck_pdfwrite.py", line 79, in runTest
    self.assertEqual(sum, gssum.get_sum(file2), "md5sum did not match baseline (" + file2 + ") for file: " + self.file)
  File "/home/regression/regression/gssum.py", line 43, in get_sum
    sum = db[file]
KeyError: waterfal.ps.pdf.ppmraw.300.0
======================================================================
ERROR: Checking pdfwrite of waterfal.ps (pkmraw/300dpi/noband) against baseline
----------------------------------------------------------------------
Traceback (most recent call last):
  File "/home/regression/regression/gscheck_pdfwrite.py", line 79, in runTest
    self.assertEqual(sum, gssum.get_sum(file2), "md5sum did not match baseline (" + file2 + ") for file: " + self.file)
  File "/home/regression/regression/gssum.py", line 43, in get_sum
    sum = db[file]
KeyError: waterfal.ps.pdf.pkmraw.300.0
======================================================================
FAIL: Checking Fixed_Original.pdf (pgmraw/300dpi/noband) against baseline
----------------------------------------------------------------------
md5sum did not match baseline (Fixed_Original.pdf.pgmraw.300.0) for file: /home/regression/comparefiles/Fixed_Original.pdf
======================================================================
FAIL: Checking Fixed_Original.pdf (pgmraw/300dpi/banded) against baseline
----------------------------------------------------------------------
md5sum did not match baseline (Fixed_Original.pdf.pgmraw.300.1) for file: /home/regression/comparefiles/Fixed_Original.pdf
======================================================================
FAIL: Checking Fixed_Original.pdf (ppmraw/300dpi/noband) against baseline
----------------------------------------------------------------------
md5sum did not match baseline (Fixed_Original.pdf.ppmraw.300.0) for file: /home/regression/comparefiles/Fixed_Original.pdf
======================================================================
FAIL: Checking Fixed_Original.pdf (ppmraw/300dpi/banded) against baseline
----------------------------------------------------------------------
md5sum did not match baseline (Fixed_Original.pdf.ppmraw.300.1) for file: /home/regression/comparefiles/Fixed_Original.pdf
======================================================================
FAIL: Checking Altona-Testsuite_p2_S_x3.pdf (pbmraw/72dpi/noband) against baseline
----------------------------------------------------------------------
md5sum did not match baseline (Altona-Testsuite_p2_S_x3.pdf.pbmraw.72.0) for file: /home/regression/comparefiles/Altona-Testsuite_p2_S_x3.pdf
======================================================================
FAIL: Checking Altona-Testsuite_p2_S_x3.pdf (pbmraw/72dpi/banded) against baseline
----------------------------------------------------------------------
md5sum did not match baseline (Altona-Testsuite_p2_S_x3.pdf.pbmraw.72.1) for file: /home/regression/comparefiles/Altona-Testsuite_p2_S_x3.pdf
======================================================================
FAIL: Checking Altona-Testsuite_p2_S_x3.pdf (pbmraw/300dpi/noband) against baseline
----------------------------------------------------------------------
md5sum did not match baseline (Altona-Testsuite_p2_S_x3.pdf.pbmraw.300.0) for file: /home/regression/comparefiles/Altona-Testsuite_p2_S_x3.pdf
======================================================================
FAIL: Checking Altona-Testsuite_p2_S_x3.pdf (pbmraw/300dpi/banded) against baseline
----------------------------------------------------------------------
md5sum did not match baseline (Altona-Testsuite_p2_S_x3.pdf.pbmraw.300.1) for file: /home/regression/comparefiles/Altona-Testsuite_p2_S_x3.pdf
======================================================================
FAIL: Checking Altona-Testsuite_p2_S_x3.pdf (pgmraw/72dpi/noband) against baseline
----------------------------------------------------------------------
md5sum did not match baseline (Altona-Testsuite_p2_S_x3.pdf.pgmraw.72.0) for file: /home/regression/comparefiles/Altona-Testsuite_p2_S_x3.pdf
======================================================================
FAIL: Checking Altona-Testsuite_p2_S_x3.pdf (pgmraw/72dpi/banded) against baseline
----------------------------------------------------------------------
md5sum did not match baseline (Altona-Testsuite_p2_S_x3.pdf.pgmraw.72.1) for file: /home/regression/comparefiles/Altona-Testsuite_p2_S_x3.pdf
======================================================================
FAIL: Checking Altona-Testsuite_p2_S_x3.pdf (pgmraw/300dpi/noband) against baseline
----------------------------------------------------------------------
md5sum did not match baseline (Altona-Testsuite_p2_S_x3.pdf.pgmraw.300.0) for file: /home/regression/comparefiles/Altona-Testsuite_p2_S_x3.pdf
======================================================================
FAIL: Checking Altona-Testsuite_p2_S_x3.pdf (pgmraw/300dpi/banded) against baseline
----------------------------------------------------------------------
md5sum did not match baseline (Altona-Testsuite_p2_S_x3.pdf.pgmraw.300.1) for file: /home/regression/comparefiles/Altona-Testsuite_p2_S_x3.pdf
======================================================================
FAIL: Checking Altona-Testsuite_p2_S_x3.pdf (ppmraw/72dpi/noband) against baseline
----------------------------------------------------------------------
md5sum did not match baseline (Altona-Testsuite_p2_S_x3.pdf.ppmraw.72.0) for file: /home/regression/comparefiles/Altona-Testsuite_p2_S_x3.pdf
======================================================================
FAIL: Checking Altona-Testsuite_p2_S_x3.pdf (ppmraw/72dpi/banded) against baseline
----------------------------------------------------------------------
md5sum did not match baseline (Altona-Testsuite_p2_S_x3.pdf.ppmraw.72.1) for file: /home/regression/comparefiles/Altona-Testsuite_p2_S_x3.pdf
======================================================================
FAIL: Checking Altona-Testsuite_p2_S_x3.pdf (ppmraw/300dpi/noband) against baseline
----------------------------------------------------------------------
md5sum did not match baseline (Altona-Testsuite_p2_S_x3.pdf.ppmraw.300.0) for file: /home/regression/comparefiles/Altona-Testsuite_p2_S_x3.pdf
======================================================================
FAIL: Checking Altona-Testsuite_p2_S_x3.pdf (ppmraw/300dpi/banded) against baseline
----------------------------------------------------------------------
md5sum did not match baseline (Altona-Testsuite_p2_S_x3.pdf.ppmraw.300.1) for file: /home/regression/comparefiles/Altona-Testsuite_p2_S_x3.pdf
======================================================================
FAIL: Checking Altona-Testsuite_p2_S_x3.pdf (pkmraw/72dpi/noband) against baseline
----------------------------------------------------------------------
md5sum did not match baseline (Altona-Testsuite_p2_S_x3.pdf.pkmraw.72.0) for file: /home/regression/comparefiles/Altona-Testsuite_p2_S_x3.pdf
======================================================================
FAIL: Checking Altona-Testsuite_p2_S_x3.pdf (pkmraw/72dpi/banded) against baseline
----------------------------------------------------------------------
md5sum did not match baseline (Altona-Testsuite_p2_S_x3.pdf.pkmraw.72.1) for file: /home/regression/comparefiles/Altona-Testsuite_p2_S_x3.pdf
======================================================================
FAIL: Checking Altona-Testsuite_p2_S_x3.pdf (pkmraw/300dpi/noband) against baseline
----------------------------------------------------------------------
md5sum did not match baseline (Altona-Testsuite_p2_S_x3.pdf.pkmraw.300.0) for file: /home/regression/comparefiles/Altona-Testsuite_p2_S_x3.pdf
======================================================================
FAIL: Checking Altona-Testsuite_p2_S_x3.pdf (pkmraw/300dpi/banded) against baseline
----------------------------------------------------------------------
md5sum did not match baseline (Altona-Testsuite_p2_S_x3.pdf.pkmraw.300.1) for file: /home/regression/comparefiles/Altona-Testsuite_p2_S_x3.pdf
======================================================================
FAIL: Checking Altona.Page_3.2002-09-27.pdf (pbmraw/72dpi/noband) against baseline
----------------------------------------------------------------------
md5sum did not match baseline (Altona.Page_3.2002-09-27.pdf.pbmraw.72.0) for file: /home/regression/comparefiles/Altona.Page_3.2002-09-27.pdf
======================================================================
FAIL: Checking Altona.Page_3.2002-09-27.pdf (pbmraw/72dpi/banded) against baseline
----------------------------------------------------------------------
md5sum did not match baseline (Altona.Page_3.2002-09-27.pdf.pbmraw.72.1) for file: /home/regression/comparefiles/Altona.Page_3.2002-09-27.pdf
======================================================================
FAIL: Checking Altona.Page_3.2002-09-27.pdf (pbmraw/300dpi/noband) against baseline
----------------------------------------------------------------------
md5sum did not match baseline (Altona.Page_3.2002-09-27.pdf.pbmraw.300.0) for file: /home/regression/comparefiles/Altona.Page_3.2002-09-27.pdf
======================================================================
FAIL: Checking Altona.Page_3.2002-09-27.pdf (pbmraw/300dpi/banded) against baseline
----------------------------------------------------------------------
md5sum did not match baseline (Altona.Page_3.2002-09-27.pdf.pbmraw.300.1) for file: /home/regression/comparefiles/Altona.Page_3.2002-09-27.pdf
======================================================================
FAIL: Checking Altona.Page_3.2002-09-27.pdf (pgmraw/72dpi/noband) against baseline
----------------------------------------------------------------------
md5sum did not match baseline (Altona.Page_3.2002-09-27.pdf.pgmraw.72.0) for file: /home/regression/comparefiles/Altona.Page_3.2002-09-27.pdf
======================================================================
FAIL: Checking Altona.Page_3.2002-09-27.pdf (pgmraw/72dpi/banded) against baseline
----------------------------------------------------------------------
md5sum did not match baseline (Altona.Page_3.2002-09-27.pdf.pgmraw.72.1) for file: /home/regression/comparefiles/Altona.Page_3.2002-09-27.pdf
======================================================================
FAIL: Checking Altona.Page_3.2002-09-27.pdf (pgmraw/300dpi/noband) against baseline
----------------------------------------------------------------------
md5sum did not match baseline (Altona.Page_3.2002-09-27.pdf.pgmraw.300.0) for file: /home/regression/comparefiles/Altona.Page_3.2002-09-27.pdf
======================================================================
FAIL: Checking Altona.Page_3.2002-09-27.pdf (pgmraw/300dpi/banded) against baseline
----------------------------------------------------------------------
md5sum did not match baseline (Altona.Page_3.2002-09-27.pdf.pgmraw.300.1) for file: /home/regression/comparefiles/Altona.Page_3.2002-09-27.pdf
======================================================================
FAIL: Checking Altona.Page_3.2002-09-27.pdf (ppmraw/72dpi/noband) against baseline
----------------------------------------------------------------------
md5sum did not match baseline (Altona.Page_3.2002-09-27.pdf.ppmraw.72.0) for file: /home/regression/comparefiles/Altona.Page_3.2002-09-27.pdf
======================================================================
FAIL: Checking Altona.Page_3.2002-09-27.pdf (ppmraw/72dpi/banded) against baseline
----------------------------------------------------------------------
md5sum did not match baseline (Altona.Page_3.2002-09-27.pdf.ppmraw.72.1) for file: /home/regression/comparefiles/Altona.Page_3.2002-09-27.pdf
======================================================================
FAIL: Checking Altona.Page_3.2002-09-27.pdf (ppmraw/300dpi/noband) against baseline
----------------------------------------------------------------------
md5sum did not match baseline (Altona.Page_3.2002-09-27.pdf.ppmraw.300.0) for file: /home/regression/comparefiles/Altona.Page_3.2002-09-27.pdf
======================================================================
FAIL: Checking Altona.Page_3.2002-09-27.pdf (ppmraw/300dpi/banded) against baseline
----------------------------------------------------------------------
md5sum did not match baseline (Altona.Page_3.2002-09-27.pdf.ppmraw.300.1) for file: /home/regression/comparefiles/Altona.Page_3.2002-09-27.pdf
======================================================================
FAIL: Checking Altona.Page_3.2002-09-27.pdf (pkmraw/72dpi/noband) against baseline
----------------------------------------------------------------------
md5sum did not match baseline (Altona.Page_3.2002-09-27.pdf.pkmraw.72.0) for file: /home/regression/comparefiles/Altona.Page_3.2002-09-27.pdf
======================================================================
FAIL: Checking Altona.Page_3.2002-09-27.pdf (pkmraw/72dpi/banded) against baseline
----------------------------------------------------------------------
md5sum did not match baseline (Altona.Page_3.2002-09-27.pdf.pkmraw.72.1) for file: /home/regression/comparefiles/Altona.Page_3.2002-09-27.pdf
======================================================================
FAIL: Checking Altona.Page_3.2002-09-27.pdf (pkmraw/300dpi/noband) against baseline
----------------------------------------------------------------------
md5sum did not match baseline (Altona.Page_3.2002-09-27.pdf.pkmraw.300.0) for file: /home/regression/comparefiles/Altona.Page_3.2002-09-27.pdf
======================================================================
FAIL: Checking Altona.Page_3.2002-09-27.pdf (pkmraw/300dpi/banded) against baseline
----------------------------------------------------------------------
md5sum did not match baseline (Altona.Page_3.2002-09-27.pdf.pkmraw.300.1) for file: /home/regression/comparefiles/Altona.Page_3.2002-09-27.pdf
======================================================================
FAIL: Checking S2_Digitalproof-Forum_x3k.pdf (pbmraw/72dpi/noband) against baseline
----------------------------------------------------------------------
md5sum did not match baseline (S2_Digitalproof-Forum_x3k.pdf.pbmraw.72.0) for file: /home/regression/comparefiles/S2_Digitalproof-Forum_x3k.pdf
======================================================================
FAIL: Checking S2_Digitalproof-Forum_x3k.pdf (pbmraw/72dpi/banded) against baseline
----------------------------------------------------------------------
md5sum did not match baseline (S2_Digitalproof-Forum_x3k.pdf.pbmraw.72.1) for file: /home/regression/comparefiles/S2_Digitalproof-Forum_x3k.pdf
======================================================================
FAIL: Checking S2_Digitalproof-Forum_x3k.pdf (pbmraw/300dpi/noband) against baseline
----------------------------------------------------------------------
md5sum did not match baseline (S2_Digitalproof-Forum_x3k.pdf.pbmraw.300.0) for file: /home/regression/comparefiles/S2_Digitalproof-Forum_x3k.pdf
======================================================================
FAIL: Checking S2_Digitalproof-Forum_x3k.pdf (pbmraw/300dpi/banded) against baseline
----------------------------------------------------------------------
md5sum did not match baseline (S2_Digitalproof-Forum_x3k.pdf.pbmraw.300.1) for file: /home/regression/comparefiles/S2_Digitalproof-Forum_x3k.pdf
======================================================================
FAIL: Checking S2_Digitalproof-Forum_x3k.pdf (pgmraw/72dpi/noband) against baseline
----------------------------------------------------------------------
md5sum did not match baseline (S2_Digitalproof-Forum_x3k.pdf.pgmraw.72.0) for file: /home/regression/comparefiles/S2_Digitalproof-Forum_x3k.pdf
======================================================================
FAIL: Checking S2_Digitalproof-Forum_x3k.pdf (pgmraw/72dpi/banded) against baseline
----------------------------------------------------------------------
md5sum did not match baseline (S2_Digitalproof-Forum_x3k.pdf.pgmraw.72.1) for file: /home/regression/comparefiles/S2_Digitalproof-Forum_x3k.pdf
======================================================================
FAIL: Checking S2_Digitalproof-Forum_x3k.pdf (pgmraw/300dpi/noband) against baseline
----------------------------------------------------------------------
md5sum did not match baseline (S2_Digitalproof-Forum_x3k.pdf.pgmraw.300.0) for file: /home/regression/comparefiles/S2_Digitalproof-Forum_x3k.pdf
======================================================================
FAIL: Checking S2_Digitalproof-Forum_x3k.pdf (pgmraw/300dpi/banded) against baseline
----------------------------------------------------------------------
md5sum did not match baseline (S2_Digitalproof-Forum_x3k.pdf.pgmraw.300.1) for file: /home/regression/comparefiles/S2_Digitalproof-Forum_x3k.pdf
======================================================================
FAIL: Checking S2_Digitalproof-Forum_x3k.pdf (ppmraw/72dpi/noband) against baseline
----------------------------------------------------------------------
md5sum did not match baseline (S2_Digitalproof-Forum_x3k.pdf.ppmraw.72.0) for file: /home/regression/comparefiles/S2_Digitalproof-Forum_x3k.pdf
======================================================================
FAIL: Checking S2_Digitalproof-Forum_x3k.pdf (ppmraw/72dpi/banded) against baseline
----------------------------------------------------------------------
md5sum did not match baseline (S2_Digitalproof-Forum_x3k.pdf.ppmraw.72.1) for file: /home/regression/comparefiles/S2_Digitalproof-Forum_x3k.pdf
======================================================================
FAIL: Checking S2_Digitalproof-Forum_x3k.pdf (ppmraw/300dpi/noband) against baseline
----------------------------------------------------------------------
md5sum did not match baseline (S2_Digitalproof-Forum_x3k.pdf.ppmraw.300.0) for file: /home/regression/comparefiles/S2_Digitalproof-Forum_x3k.pdf
======================================================================
FAIL: Checking S2_Digitalproof-Forum_x3k.pdf (ppmraw/300dpi/banded) against baseline
----------------------------------------------------------------------
md5sum did not match baseline (S2_Digitalproof-Forum_x3k.pdf.ppmraw.300.1) for file: /home/regression/comparefiles/S2_Digitalproof-Forum_x3k.pdf
======================================================================
FAIL: Checking S2_Digitalproof-Forum_x3k.pdf (pkmraw/72dpi/noband) against baseline
----------------------------------------------------------------------
md5sum did not match baseline (S2_Digitalproof-Forum_x3k.pdf.pkmraw.72.0) for file: /home/regression/comparefiles/S2_Digitalproof-Forum_x3k.pdf
======================================================================
FAIL: Checking S2_Digitalproof-Forum_x3k.pdf (pkmraw/72dpi/banded) against baseline
----------------------------------------------------------------------
md5sum did not match baseline (S2_Digitalproof-Forum_x3k.pdf.pkmraw.72.1) for file: /home/regression/comparefiles/S2_Digitalproof-Forum_x3k.pdf
======================================================================
FAIL: Checking S2_Digitalproof-Forum_x3k.pdf (pkmraw/300dpi/noband) against baseline
----------------------------------------------------------------------
md5sum did not match baseline (S2_Digitalproof-Forum_x3k.pdf.pkmraw.300.0) for file: /home/regression/comparefiles/S2_Digitalproof-Forum_x3k.pdf
======================================================================
FAIL: Checking S2_Digitalproof-Forum_x3k.pdf (pkmraw/300dpi/banded) against baseline
----------------------------------------------------------------------
md5sum did not match baseline (S2_Digitalproof-Forum_x3k.pdf.pkmraw.300.1) for file: /home/regression/comparefiles/S2_Digitalproof-Forum_x3k.pdf
======================================================================
FAIL: Checking Testform.v1.0.2.pdf (pbmraw/72dpi/noband) against baseline
----------------------------------------------------------------------
md5sum did not match baseline (Testform.v1.0.2.pdf.pbmraw.72.0) for file: /home/regression/comparefiles/Testform.v1.0.2.pdf
======================================================================
FAIL: Checking Testform.v1.0.2.pdf (pbmraw/72dpi/banded) against baseline
----------------------------------------------------------------------
md5sum did not match baseline (Testform.v1.0.2.pdf.pbmraw.72.1) for file: /home/regression/comparefiles/Testform.v1.0.2.pdf
======================================================================
FAIL: Checking Testform.v1.0.2.pdf (pbmraw/300dpi/noband) against baseline
----------------------------------------------------------------------
md5sum did not match baseline (Testform.v1.0.2.pdf.pbmraw.300.0) for file: /home/regression/comparefiles/Testform.v1.0.2.pdf
======================================================================
FAIL: Checking Testform.v1.0.2.pdf (pbmraw/300dpi/banded) against baseline
----------------------------------------------------------------------
md5sum did not match baseline (Testform.v1.0.2.pdf.pbmraw.300.1) for file: /home/regression/comparefiles/Testform.v1.0.2.pdf
======================================================================
FAIL: Checking Testform.v1.0.2.pdf (pgmraw/72dpi/noband) against baseline
----------------------------------------------------------------------
md5sum did not match baseline (Testform.v1.0.2.pdf.pgmraw.72.0) for file: /home/regression/comparefiles/Testform.v1.0.2.pdf
======================================================================
FAIL: Checking Testform.v1.0.2.pdf (pgmraw/72dpi/banded) against baseline
----------------------------------------------------------------------
md5sum did not match baseline (Testform.v1.0.2.pdf.pgmraw.72.1) for file: /home/regression/comparefiles/Testform.v1.0.2.pdf
======================================================================
FAIL: Checking Testform.v1.0.2.pdf (pgmraw/300dpi/noband) against baseline
----------------------------------------------------------------------
md5sum did not match baseline (Testform.v1.0.2.pdf.pgmraw.300.0) for file: /home/regression/comparefiles/Testform.v1.0.2.pdf
======================================================================
FAIL: Checking Testform.v1.0.2.pdf (pgmraw/300dpi/banded) against baseline
----------------------------------------------------------------------
md5sum did not match baseline (Testform.v1.0.2.pdf.pgmraw.300.1) for file: /home/regression/comparefiles/Testform.v1.0.2.pdf
======================================================================
FAIL: Checking Testform.v1.0.2.pdf (ppmraw/72dpi/noband) against baseline
----------------------------------------------------------------------
md5sum did not match baseline (Testform.v1.0.2.pdf.ppmraw.72.0) for file: /home/regression/comparefiles/Testform.v1.0.2.pdf
======================================================================
FAIL: Checking Testform.v1.0.2.pdf (ppmraw/72dpi/banded) against baseline
----------------------------------------------------------------------
md5sum did not match baseline (Testform.v1.0.2.pdf.ppmraw.72.1) for file: /home/regression/comparefiles/Testform.v1.0.2.pdf
======================================================================
FAIL: Checking Testform.v1.0.2.pdf (ppmraw/300dpi/noband) against baseline
----------------------------------------------------------------------
md5sum did not match baseline (Testform.v1.0.2.pdf.ppmraw.300.0) for file: /home/regression/comparefiles/Testform.v1.0.2.pdf
======================================================================
FAIL: Checking Testform.v1.0.2.pdf (ppmraw/300dpi/banded) against baseline
----------------------------------------------------------------------
md5sum did not match baseline (Testform.v1.0.2.pdf.ppmraw.300.1) for file: /home/regression/comparefiles/Testform.v1.0.2.pdf
======================================================================
FAIL: Checking Testform.v1.0.2.pdf (pkmraw/72dpi/noband) against baseline
----------------------------------------------------------------------
md5sum did not match baseline (Testform.v1.0.2.pdf.pkmraw.72.0) for file: /home/regression/comparefiles/Testform.v1.0.2.pdf
======================================================================
FAIL: Checking Testform.v1.0.2.pdf (pkmraw/72dpi/banded) against baseline
----------------------------------------------------------------------
md5sum did not match baseline (Testform.v1.0.2.pdf.pkmraw.72.1) for file: /home/regression/comparefiles/Testform.v1.0.2.pdf
======================================================================
FAIL: Checking Testform.v1.0.2.pdf (pkmraw/300dpi/noband) against baseline
----------------------------------------------------------------------
md5sum did not match baseline (Testform.v1.0.2.pdf.pkmraw.300.0) for file: /home/regression/comparefiles/Testform.v1.0.2.pdf
======================================================================
FAIL: Checking Testform.v1.0.2.pdf (pkmraw/300dpi/banded) against baseline
----------------------------------------------------------------------
md5sum did not match baseline (Testform.v1.0.2.pdf.pkmraw.300.1) for file: /home/regression/comparefiles/Testform.v1.0.2.pdf
======================================================================
FAIL: Checking pdfwrite of 321-05.ps (ppmraw/300dpi/noband) against baseline
----------------------------------------------------------------------
md5sum did not match baseline (321-05.ps.pdf.ppmraw.300.0) for file: /home/regression/comparefiles/321-05.ps
======================================================================
FAIL: Checking pdfwrite of 321-05.ps (pkmraw/300dpi/noband) against baseline
----------------------------------------------------------------------
md5sum did not match baseline (321-05.ps.pdf.pkmraw.300.0) for file: /home/regression/comparefiles/321-05.ps
======================================================================
FAIL: Checking pdfwrite of Fixed_Original.pdf (ppmraw/300dpi/noband) against baseline
----------------------------------------------------------------------
md5sum did not match baseline (Fixed_Original.pdf.pdf.ppmraw.300.0) for file: /home/regression/comparefiles/Fixed_Original.pdf
======================================================================
FAIL: Checking pdfwrite of QA_Inv.pdf (ppmraw/72dpi/noband) against baseline
----------------------------------------------------------------------
md5sum did not match baseline (QA_Inv.pdf.pdf.ppmraw.72.0) for file: /home/regression/comparefiles/QA_Inv.pdf
======================================================================
FAIL: Checking pdfwrite of QA_Inv.pdf (ppmraw/300dpi/noband) against baseline
----------------------------------------------------------------------
md5sum did not match baseline (QA_Inv.pdf.pdf.ppmraw.300.0) for file: /home/regression/comparefiles/QA_Inv.pdf
======================================================================
FAIL: Checking pdfwrite of QA_Inv.pdf (pkmraw/300dpi/noband) against baseline
----------------------------------------------------------------------
md5sum did not match baseline (QA_Inv.pdf.pdf.pkmraw.300.0) for file: /home/regression/comparefiles/QA_Inv.pdf
======================================================================
FAIL: Checking pdfwrite of gs.anotherfailure.pdf (ppmraw/72dpi/noband) against baseline
----------------------------------------------------------------------
md5sum did not match baseline (gs.anotherfailure.pdf.pdf.ppmraw.72.0) for file: /home/regression/comparefiles/gs.anotherfailure.pdf
======================================================================
FAIL: Checking pdfwrite of gs.anotherfailure.pdf (ppmraw/300dpi/noband) against baseline
----------------------------------------------------------------------
md5sum did not match baseline (gs.anotherfailure.pdf.pdf.ppmraw.300.0) for file: /home/regression/comparefiles/gs.anotherfailure.pdf
======================================================================
FAIL: Checking pdfwrite of gs.anotherfailure.pdf (pkmraw/300dpi/noband) against baseline
----------------------------------------------------------------------
md5sum did not match baseline (gs.anotherfailure.pdf.pdf.pkmraw.300.0) for file: /home/regression/comparefiles/gs.anotherfailure.pdf
======================================================================
FAIL: Checking pdfwrite of gs5.98-dragon.pdf (ppmraw/72dpi/noband) against baseline
----------------------------------------------------------------------
md5sum did not match baseline (gs5.98-dragon.pdf.pdf.ppmraw.72.0) for file: /home/regression/comparefiles/gs5.98-dragon.pdf
======================================================================
FAIL: Checking pdfwrite of gs5.98-dragon.pdf (ppmraw/300dpi/noband) against baseline
----------------------------------------------------------------------
md5sum did not match baseline (gs5.98-dragon.pdf.pdf.ppmraw.300.0) for file: /home/regression/comparefiles/gs5.98-dragon.pdf
======================================================================
FAIL: Checking pdfwrite of gs5.98-dragon.pdf (pkmraw/300dpi/noband) against baseline
----------------------------------------------------------------------
md5sum did not match baseline (gs5.98-dragon.pdf.pdf.pkmraw.300.0) for file: /home/regression/comparefiles/gs5.98-dragon.pdf
======================================================================
FAIL: Checking pdfwrite of kazmir.pdf (ppmraw/72dpi/noband) against baseline
----------------------------------------------------------------------
md5sum did not match baseline (kazmir.pdf.pdf.ppmraw.72.0) for file: /home/regression/comparefiles/kazmir.pdf
======================================================================
FAIL: Checking pdfwrite of kazmir.pdf (ppmraw/300dpi/noband) against baseline
----------------------------------------------------------------------
md5sum did not match baseline (kazmir.pdf.pdf.ppmraw.300.0) for file: /home/regression/comparefiles/kazmir.pdf
======================================================================
FAIL: Checking pdfwrite of kazmir.pdf (pkmraw/300dpi/noband) against baseline
----------------------------------------------------------------------
md5sum did not match baseline (kazmir.pdf.pdf.pkmraw.300.0) for file: /home/regression/comparefiles/kazmir.pdf
======================================================================
FAIL: Checking pdfwrite of knight.pdf (ppmraw/300dpi/noband) against baseline
----------------------------------------------------------------------
md5sum did not match baseline (knight.pdf.pdf.ppmraw.300.0) for file: /home/regression/comparefiles/knight.pdf
======================================================================
FAIL: Checking pdfwrite of knight.pdf (pkmraw/300dpi/noband) against baseline
----------------------------------------------------------------------
md5sum did not match baseline (knight.pdf.pdf.pkmraw.300.0) for file: /home/regression/comparefiles/knight.pdf
======================================================================
FAIL: Checking pdfwrite of test2.pdf (ppmraw/72dpi/noband) against baseline
----------------------------------------------------------------------
md5sum did not match baseline (test2.pdf.pdf.ppmraw.72.0) for file: /home/regression/comparefiles/test2.pdf
======================================================================
FAIL: Checking pdfwrite of CAT_LOGO.ps (ppmraw/72dpi/noband) against baseline
----------------------------------------------------------------------
md5sum did not match baseline (CAT_LOGO.ps.pdf.ppmraw.72.0) for file: /home/regression/comparefiles/CAT_LOGO.ps
======================================================================
FAIL: Checking pdfwrite of CAT_LOGO.ps (ppmraw/300dpi/noband) against baseline
----------------------------------------------------------------------
md5sum did not match baseline (CAT_LOGO.ps.pdf.ppmraw.300.0) for file: /home/regression/comparefiles/CAT_LOGO.ps
======================================================================
FAIL: Checking pdfwrite of CAT_LOGO.ps (pkmraw/300dpi/noband) against baseline
----------------------------------------------------------------------
md5sum did not match baseline (CAT_LOGO.ps.pdf.pkmraw.300.0) for file: /home/regression/comparefiles/CAT_LOGO.ps
----------------------------------------------------------------------
Ran 7293 tests in 9970.818s

FAILED (failures=89, errors=297)