[gs-regression] gs regression report - 2002-10-28

regression@casper.ghostscript.com regression@casper.ghostscript.com
Mon, 28 Oct 2002 05:46:16 -0800


The following regression changes happened since yesterday's report:
normal snowflak.ps (pbmraw/72/banded)
normal snowflak.ps (pbmraw/72/noband)
normal snowflak.ps (pbmraw/300/banded)
normal snowflak.ps (pbmraw/300/noband)
normal snowflak.ps (pgmraw/72/banded)
normal snowflak.ps (pgmraw/72/noband)
normal snowflak.ps (pgmraw/300/banded)
normal snowflak.ps (pgmraw/300/noband)
normal snowflak.ps (pkmraw/72/banded)
normal snowflak.ps (pkmraw/72/noband)
normal snowflak.ps (pkmraw/300/banded)
normal snowflak.ps (pkmraw/300/noband)
normal snowflak.ps (ppmraw/72/banded)
normal snowflak.ps (ppmraw/72/noband)
normal snowflak.ps (ppmraw/300/banded)
normal snowflak.ps (ppmraw/300/noband)
pdfwrite snowflak.ps (pkmraw/300/noband)
pdfwrite snowflak.ps (ppmraw/72/noband)
pdfwrite snowflak.ps (ppmraw/300/noband)


The complete list of regressions for today:
Checking Fixed_Original.pdf (pgmraw/300dpi/noband) against baseline ... DIFFER
Checking Fixed_Original.pdf (pgmraw/300dpi/banded) against baseline ... DIFFER
Checking Fixed_Original.pdf (ppmraw/300dpi/noband) against baseline ... DIFFER
Checking Fixed_Original.pdf (ppmraw/300dpi/banded) against baseline ... DIFFER
Checking Altona-Testsuite_p2_S_x3.pdf (pbmraw/72dpi/noband) against baseline ... DIFFER
Checking Altona-Testsuite_p2_S_x3.pdf (pbmraw/72dpi/banded) against baseline ... DIFFER
Checking Altona-Testsuite_p2_S_x3.pdf (pbmraw/300dpi/noband) against baseline ... DIFFER
Checking Altona-Testsuite_p2_S_x3.pdf (pbmraw/300dpi/banded) against baseline ... DIFFER
Checking Altona-Testsuite_p2_S_x3.pdf (pgmraw/72dpi/noband) against baseline ... DIFFER
Checking Altona-Testsuite_p2_S_x3.pdf (pgmraw/72dpi/banded) against baseline ... DIFFER
Checking Altona-Testsuite_p2_S_x3.pdf (pgmraw/300dpi/noband) against baseline ... DIFFER
Checking Altona-Testsuite_p2_S_x3.pdf (pgmraw/300dpi/banded) against baseline ... DIFFER
Checking Altona-Testsuite_p2_S_x3.pdf (ppmraw/72dpi/noband) against baseline ... DIFFER
Checking Altona-Testsuite_p2_S_x3.pdf (ppmraw/72dpi/banded) against baseline ... DIFFER
Checking Altona-Testsuite_p2_S_x3.pdf (ppmraw/300dpi/noband) against baseline ... DIFFER
Checking Altona-Testsuite_p2_S_x3.pdf (ppmraw/300dpi/banded) against baseline ... DIFFER
Checking Altona-Testsuite_p2_S_x3.pdf (pkmraw/72dpi/noband) against baseline ... DIFFER
Checking Altona-Testsuite_p2_S_x3.pdf (pkmraw/72dpi/banded) against baseline ... DIFFER
Checking Altona-Testsuite_p2_S_x3.pdf (pkmraw/300dpi/noband) against baseline ... DIFFER
Checking Altona-Testsuite_p2_S_x3.pdf (pkmraw/300dpi/banded) against baseline ... DIFFER
Checking Altona.Page_3.2002-09-27.pdf (pbmraw/72dpi/noband) against baseline ... DIFFER
Checking Altona.Page_3.2002-09-27.pdf (pbmraw/72dpi/banded) against baseline ... DIFFER
Checking Altona.Page_3.2002-09-27.pdf (pbmraw/300dpi/noband) against baseline ... DIFFER
Checking Altona.Page_3.2002-09-27.pdf (pbmraw/300dpi/banded) against baseline ... DIFFER
Checking Altona.Page_3.2002-09-27.pdf (pgmraw/72dpi/noband) against baseline ... DIFFER
Checking Altona.Page_3.2002-09-27.pdf (pgmraw/72dpi/banded) against baseline ... DIFFER
Checking Altona.Page_3.2002-09-27.pdf (pgmraw/300dpi/noband) against baseline ... DIFFER
Checking Altona.Page_3.2002-09-27.pdf (pgmraw/300dpi/banded) against baseline ... DIFFER
Checking Altona.Page_3.2002-09-27.pdf (ppmraw/72dpi/noband) against baseline ... DIFFER
Checking Altona.Page_3.2002-09-27.pdf (ppmraw/72dpi/banded) against baseline ... DIFFER
Checking Altona.Page_3.2002-09-27.pdf (ppmraw/300dpi/noband) against baseline ... DIFFER
Checking Altona.Page_3.2002-09-27.pdf (ppmraw/300dpi/banded) against baseline ... DIFFER
Checking Altona.Page_3.2002-09-27.pdf (pkmraw/72dpi/noband) against baseline ... DIFFER
Checking Altona.Page_3.2002-09-27.pdf (pkmraw/72dpi/banded) against baseline ... DIFFER
Checking Altona.Page_3.2002-09-27.pdf (pkmraw/300dpi/noband) against baseline ... DIFFER
Checking Altona.Page_3.2002-09-27.pdf (pkmraw/300dpi/banded) against baseline ... DIFFER
Checking S2_Digitalproof-Forum_circles.pdf (pbmraw/72dpi/noband) against baseline ... ERROR
Checking S2_Digitalproof-Forum_circles.pdf (pbmraw/72dpi/banded) against baseline ... ERROR
Checking S2_Digitalproof-Forum_circles.pdf (pbmraw/300dpi/noband) against baseline ... ERROR
Checking S2_Digitalproof-Forum_circles.pdf (pbmraw/300dpi/banded) against baseline ... ERROR
Checking S2_Digitalproof-Forum_circles.pdf (pgmraw/72dpi/noband) against baseline ... ERROR
Checking S2_Digitalproof-Forum_circles.pdf (pgmraw/72dpi/banded) against baseline ... ERROR
Checking S2_Digitalproof-Forum_circles.pdf (pgmraw/300dpi/noband) against baseline ... ERROR
Checking S2_Digitalproof-Forum_circles.pdf (pgmraw/300dpi/banded) against baseline ... ERROR
Checking S2_Digitalproof-Forum_circles.pdf (ppmraw/72dpi/noband) against baseline ... ERROR
Checking S2_Digitalproof-Forum_circles.pdf (ppmraw/72dpi/banded) against baseline ... ERROR
Checking S2_Digitalproof-Forum_circles.pdf (ppmraw/300dpi/noband) against baseline ... ERROR
Checking S2_Digitalproof-Forum_circles.pdf (ppmraw/300dpi/banded) against baseline ... ERROR
Checking S2_Digitalproof-Forum_circles.pdf (pkmraw/72dpi/noband) against baseline ... ERROR
Checking S2_Digitalproof-Forum_circles.pdf (pkmraw/72dpi/banded) against baseline ... ERROR
Checking S2_Digitalproof-Forum_circles.pdf (pkmraw/300dpi/noband) against baseline ... ERROR
Checking S2_Digitalproof-Forum_circles.pdf (pkmraw/300dpi/banded) against baseline ... ERROR
Checking S2_Digitalproof-Forum_x3k.pdf (pbmraw/72dpi/noband) against baseline ... DIFFER
Checking S2_Digitalproof-Forum_x3k.pdf (pbmraw/72dpi/banded) against baseline ... DIFFER
Checking S2_Digitalproof-Forum_x3k.pdf (pbmraw/300dpi/noband) against baseline ... DIFFER
Checking S2_Digitalproof-Forum_x3k.pdf (pbmraw/300dpi/banded) against baseline ... DIFFER
Checking S2_Digitalproof-Forum_x3k.pdf (pgmraw/72dpi/noband) against baseline ... DIFFER
Checking S2_Digitalproof-Forum_x3k.pdf (pgmraw/72dpi/banded) against baseline ... DIFFER
Checking S2_Digitalproof-Forum_x3k.pdf (pgmraw/300dpi/noband) against baseline ... DIFFER
Checking S2_Digitalproof-Forum_x3k.pdf (pgmraw/300dpi/banded) against baseline ... DIFFER
Checking S2_Digitalproof-Forum_x3k.pdf (ppmraw/72dpi/noband) against baseline ... DIFFER
Checking S2_Digitalproof-Forum_x3k.pdf (ppmraw/72dpi/banded) against baseline ... DIFFER
Checking S2_Digitalproof-Forum_x3k.pdf (ppmraw/300dpi/noband) against baseline ... DIFFER
Checking S2_Digitalproof-Forum_x3k.pdf (ppmraw/300dpi/banded) against baseline ... DIFFER
Checking S2_Digitalproof-Forum_x3k.pdf (pkmraw/72dpi/noband) against baseline ... DIFFER
Checking S2_Digitalproof-Forum_x3k.pdf (pkmraw/72dpi/banded) against baseline ... DIFFER
Checking S2_Digitalproof-Forum_x3k.pdf (pkmraw/300dpi/noband) against baseline ... DIFFER
Checking S2_Digitalproof-Forum_x3k.pdf (pkmraw/300dpi/banded) against baseline ... DIFFER
Checking Testform.v1.0.2.pdf (pbmraw/72dpi/noband) against baseline ... DIFFER
Checking Testform.v1.0.2.pdf (pbmraw/72dpi/banded) against baseline ... DIFFER
Checking Testform.v1.0.2.pdf (pbmraw/300dpi/noband) against baseline ... DIFFER
Checking Testform.v1.0.2.pdf (pbmraw/300dpi/banded) against baseline ... DIFFER
Checking Testform.v1.0.2.pdf (pgmraw/72dpi/noband) against baseline ... DIFFER
Checking Testform.v1.0.2.pdf (pgmraw/72dpi/banded) against baseline ... DIFFER
Checking Testform.v1.0.2.pdf (pgmraw/300dpi/noband) against baseline ... DIFFER
Checking Testform.v1.0.2.pdf (pgmraw/300dpi/banded) against baseline ... DIFFER
Checking Testform.v1.0.2.pdf (ppmraw/72dpi/noband) against baseline ... DIFFER
Checking Testform.v1.0.2.pdf (ppmraw/72dpi/banded) against baseline ... DIFFER
Checking Testform.v1.0.2.pdf (ppmraw/300dpi/noband) against baseline ... DIFFER
Checking Testform.v1.0.2.pdf (ppmraw/300dpi/banded) against baseline ... DIFFER
Checking Testform.v1.0.2.pdf (pkmraw/72dpi/noband) against baseline ... DIFFER
Checking Testform.v1.0.2.pdf (pkmraw/72dpi/banded) against baseline ... DIFFER
Checking Testform.v1.0.2.pdf (pkmraw/300dpi/noband) against baseline ... DIFFER
Checking Testform.v1.0.2.pdf (pkmraw/300dpi/banded) against baseline ... DIFFER
Checking Es001-01.pdf (pbmraw/72dpi/noband) against baseline ... DIFFER
Checking Es001-01.pdf (pbmraw/72dpi/banded) against baseline ... DIFFER
Checking Es001-01.pdf (pbmraw/300dpi/noband) against baseline ... DIFFER
Checking Es001-01.pdf (pbmraw/300dpi/banded) against baseline ... DIFFER
Checking Es001-01.pdf (pgmraw/72dpi/noband) against baseline ... DIFFER
Checking Es001-01.pdf (pgmraw/72dpi/banded) against baseline ... DIFFER
Checking Es001-01.pdf (pgmraw/300dpi/noband) against baseline ... DIFFER
Checking Es001-01.pdf (pgmraw/300dpi/banded) against baseline ... DIFFER
Checking Es001-01.pdf (ppmraw/72dpi/noband) against baseline ... DIFFER
Checking Es001-01.pdf (ppmraw/72dpi/banded) against baseline ... DIFFER
Checking Es001-01.pdf (ppmraw/300dpi/noband) against baseline ... DIFFER
Checking Es001-01.pdf (ppmraw/300dpi/banded) against baseline ... DIFFER
Checking Es001-01.pdf (pkmraw/72dpi/noband) against baseline ... DIFFER
Checking Es001-01.pdf (pkmraw/72dpi/banded) against baseline ... DIFFER
Checking Es001-01.pdf (pkmraw/300dpi/noband) against baseline ... DIFFER
Checking Es001-01.pdf (pkmraw/300dpi/banded) against baseline ... DIFFER
Checking annots.pdf (pbmraw/72dpi/banded) against baseline ... DIFFER
Checking annots.pdf (pgmraw/72dpi/banded) against baseline ... DIFFER
Checking annots.pdf (ppmraw/72dpi/banded) against baseline ... DIFFER
Checking annots.pdf (pkmraw/72dpi/banded) against baseline ... DIFFER
Checking ridt91.eps (pbmraw/72dpi/noband) against baseline ... ERROR
Checking ridt91.eps (pbmraw/72dpi/banded) against baseline ... ERROR
Checking ridt91.eps (pbmraw/300dpi/noband) against baseline ... ERROR
Checking ridt91.eps (pbmraw/300dpi/banded) against baseline ... ERROR
Checking ridt91.eps (pgmraw/72dpi/noband) against baseline ... ERROR
Checking ridt91.eps (pgmraw/72dpi/banded) against baseline ... ERROR
Checking ridt91.eps (pgmraw/300dpi/noband) against baseline ... ERROR
Checking ridt91.eps (pgmraw/300dpi/banded) against baseline ... ERROR
Checking ridt91.eps (ppmraw/72dpi/noband) against baseline ... ERROR
Checking ridt91.eps (ppmraw/72dpi/banded) against baseline ... ERROR
Checking ridt91.eps (ppmraw/300dpi/noband) against baseline ... ERROR
Checking ridt91.eps (ppmraw/300dpi/banded) against baseline ... ERROR
Checking ridt91.eps (pkmraw/72dpi/noband) against baseline ... ERROR
Checking ridt91.eps (pkmraw/72dpi/banded) against baseline ... ERROR
Checking ridt91.eps (pkmraw/300dpi/noband) against baseline ... ERROR
Checking ridt91.eps (pkmraw/300dpi/banded) against baseline ... ERROR
Checking pdfwrite of 0.pdf (ppmraw/72dpi/noband) against baseline ... DIFFER
Checking pdfwrite of 0.pdf (ppmraw/300dpi/noband) against baseline ... DIFFER
Checking pdfwrite of 0.pdf (pkmraw/300dpi/noband) against baseline ... DIFFER
Checking pdfwrite of 000040cf.000_60.pdf (ppmraw/72dpi/noband) against baseline ... DIFFER
Checking pdfwrite of 000040cf.000_60.pdf (ppmraw/300dpi/noband) against baseline ... DIFFER
Checking pdfwrite of 000040cf.000_60.pdf (pkmraw/300dpi/noband) against baseline ... DIFFER
Checking pdfwrite of 321-05.ps (ppmraw/300dpi/noband) against baseline ... DIFFER
Checking pdfwrite of 321-05.ps (pkmraw/300dpi/noband) against baseline ... DIFFER
Checking pdfwrite of 455690.pdf (ppmraw/72dpi/noband) against baseline ... DIFFER
Checking pdfwrite of 86554321.pdf (ppmraw/72dpi/noband) against baseline ... DIFFER
Checking pdfwrite of 86554321.pdf (ppmraw/300dpi/noband) against baseline ... DIFFER
Checking pdfwrite of 86554321.pdf (pkmraw/300dpi/noband) against baseline ... DIFFER
Checking pdfwrite of ADOBE1-4.pdf (ppmraw/72dpi/noband) against baseline ... DIFFER
Checking pdfwrite of ADOBE1-4.pdf (ppmraw/300dpi/noband) against baseline ... DIFFER
Checking pdfwrite of ADOBE1-4.pdf (pkmraw/300dpi/noband) against baseline ... DIFFER
Checking pdfwrite of Fixed_Original.pdf (ppmraw/300dpi/noband) against baseline ... DIFFER
Checking pdfwrite of H00216q.pdf (ppmraw/72dpi/noband) against baseline ... DIFFER
Checking pdfwrite of H00216q.pdf (ppmraw/300dpi/noband) against baseline ... DIFFER
Checking pdfwrite of H00216q.pdf (pkmraw/300dpi/noband) against baseline ... DIFFER
Checking pdfwrite of Jahr2000.pdf (ppmraw/72dpi/noband) against baseline ... DIFFER
Checking pdfwrite of Jahr2000.pdf (ppmraw/300dpi/noband) against baseline ... DIFFER
Checking pdfwrite of Jahr2000.pdf (pkmraw/300dpi/noband) against baseline ... DIFFER
Checking pdfwrite of LD.pdf (ppmraw/72dpi/noband) against baseline ... DIFFER
Checking pdfwrite of LD.pdf (ppmraw/300dpi/noband) against baseline ... DIFFER
Checking pdfwrite of LD.pdf (pkmraw/300dpi/noband) against baseline ... DIFFER
Checking pdfwrite of NECPNTD.pdf (ppmraw/72dpi/noband) against baseline ... DIFFER
Checking pdfwrite of NECPNTD.pdf (ppmraw/300dpi/noband) against baseline ... DIFFER
Checking pdfwrite of NECPNTD.pdf (pkmraw/300dpi/noband) against baseline ... DIFFER
Checking pdfwrite of QA_Inv.pdf (ppmraw/72dpi/noband) against baseline ... DIFFER
Checking pdfwrite of QA_Inv.pdf (ppmraw/300dpi/noband) against baseline ... DIFFER
Checking pdfwrite of QA_Inv.pdf (pkmraw/300dpi/noband) against baseline ... DIFFER
Checking pdfwrite of RealCities.pdf (ppmraw/72dpi/noband) against baseline ... DIFFER
Checking pdfwrite of RealCities.pdf (ppmraw/300dpi/noband) against baseline ... DIFFER
Checking pdfwrite of RealCities.pdf (pkmraw/300dpi/noband) against baseline ... DIFFER
Checking pdfwrite of aaon97_p7.pdf (ppmraw/72dpi/noband) against baseline ... DIFFER
Checking pdfwrite of aaon97_p7.pdf (ppmraw/300dpi/noband) against baseline ... DIFFER
Checking pdfwrite of aaon97_p7.pdf (pkmraw/300dpi/noband) against baseline ... DIFFER
Checking pdfwrite of acrobat.pdf (ppmraw/72dpi/noband) against baseline ... DIFFER
Checking pdfwrite of acrobat.pdf (ppmraw/300dpi/noband) against baseline ... DIFFER
Checking pdfwrite of acrobat.pdf (pkmraw/300dpi/noband) against baseline ... DIFFER
Checking pdfwrite of adesso1.pdf (ppmraw/72dpi/noband) against baseline ... DIFFER
Checking pdfwrite of adesso1.pdf (ppmraw/300dpi/noband) against baseline ... DIFFER
Checking pdfwrite of adesso1.pdf (pkmraw/300dpi/noband) against baseline ... DIFFER
Checking pdfwrite of adesso3.pdf (ppmraw/72dpi/noband) against baseline ... DIFFER
Checking pdfwrite of adesso3.pdf (ppmraw/300dpi/noband) against baseline ... DIFFER
Checking pdfwrite of adesso3.pdf (pkmraw/300dpi/noband) against baseline ... DIFFER
Checking pdfwrite of adesso5.pdf (ppmraw/72dpi/noband) against baseline ... DIFFER
Checking pdfwrite of adesso5.pdf (ppmraw/300dpi/noband) against baseline ... DIFFER
Checking pdfwrite of adesso5.pdf (pkmraw/300dpi/noband) against baseline ... DIFFER
Checking pdfwrite of adesso6.pdf (ppmraw/72dpi/noband) against baseline ... DIFFER
Checking pdfwrite of adesso6.pdf (ppmraw/300dpi/noband) against baseline ... DIFFER
Checking pdfwrite of adesso6.pdf (pkmraw/300dpi/noband) against baseline ... DIFFER
Checking pdfwrite of adesso7.pdf (ppmraw/72dpi/noband) against baseline ... DIFFER
Checking pdfwrite of adesso7.pdf (ppmraw/300dpi/noband) against baseline ... DIFFER
Checking pdfwrite of adesso7.pdf (pkmraw/300dpi/noband) against baseline ... DIFFER
Checking pdfwrite of brochurep1.pdf (ppmraw/72dpi/noband) against baseline ... DIFFER
Checking pdfwrite of brochurep1.pdf (ppmraw/300dpi/noband) against baseline ... DIFFER
Checking pdfwrite of brochurep1.pdf (pkmraw/300dpi/noband) against baseline ... DIFFER
Checking pdfwrite of ccc.pdf (ppmraw/72dpi/noband) against baseline ... DIFFER
Checking pdfwrite of ccc.pdf (ppmraw/300dpi/noband) against baseline ... DIFFER
Checking pdfwrite of ccc.pdf (pkmraw/300dpi/noband) against baseline ... DIFFER
Checking pdfwrite of chstudy.pdf (ppmraw/72dpi/noband) against baseline ... DIFFER
Checking pdfwrite of chstudy.pdf (ppmraw/300dpi/noband) against baseline ... DIFFER
Checking pdfwrite of chstudy.pdf (pkmraw/300dpi/noband) against baseline ... DIFFER
Checking pdfwrite of gs.anotherfailure.pdf (ppmraw/72dpi/noband) against baseline ... DIFFER
Checking pdfwrite of gs.anotherfailure.pdf (ppmraw/300dpi/noband) against baseline ... DIFFER
Checking pdfwrite of gs.anotherfailure.pdf (pkmraw/300dpi/noband) against baseline ... DIFFER
Checking pdfwrite of gs5.98-dragon.pdf (ppmraw/72dpi/noband) against baseline ... DIFFER
Checking pdfwrite of gs5.98-dragon.pdf (ppmraw/300dpi/noband) against baseline ... DIFFER
Checking pdfwrite of gs5.98-dragon.pdf (pkmraw/300dpi/noband) against baseline ... DIFFER
Checking pdfwrite of js.pdf (ppmraw/72dpi/noband) against baseline ... DIFFER
Checking pdfwrite of js.pdf (ppmraw/300dpi/noband) against baseline ... DIFFER
Checking pdfwrite of js.pdf (pkmraw/300dpi/noband) against baseline ... DIFFER
Checking pdfwrite of kazmir.pdf (ppmraw/72dpi/noband) against baseline ... DIFFER
Checking pdfwrite of kazmir.pdf (ppmraw/300dpi/noband) against baseline ... DIFFER
Checking pdfwrite of kazmir.pdf (pkmraw/300dpi/noband) against baseline ... DIFFER
Checking pdfwrite of knight.pdf (ppmraw/300dpi/noband) against baseline ... DIFFER
Checking pdfwrite of knight.pdf (pkmraw/300dpi/noband) against baseline ... DIFFER
Checking pdfwrite of narrow_font.pdf (ppmraw/72dpi/noband) against baseline ... DIFFER
Checking pdfwrite of narrow_font.pdf (ppmraw/300dpi/noband) against baseline ... DIFFER
Checking pdfwrite of narrow_font.pdf (pkmraw/300dpi/noband) against baseline ... DIFFER
Checking pdfwrite of pdftops.pdf (ppmraw/72dpi/noband) against baseline ... DIFFER
Checking pdfwrite of pdftops.pdf (ppmraw/300dpi/noband) against baseline ... DIFFER
Checking pdfwrite of pdftops.pdf (pkmraw/300dpi/noband) against baseline ... DIFFER
Checking pdfwrite of prfmm.pdf (ppmraw/72dpi/noband) against baseline ... DIFFER
Checking pdfwrite of prfmm.pdf (ppmraw/300dpi/noband) against baseline ... DIFFER
Checking pdfwrite of prfmm.pdf (pkmraw/300dpi/noband) against baseline ... DIFFER
Checking pdfwrite of rf1025.pdf (ppmraw/72dpi/noband) against baseline ... DIFFER
Checking pdfwrite of rf1025.pdf (ppmraw/300dpi/noband) against baseline ... DIFFER
Checking pdfwrite of rf1025.pdf (pkmraw/300dpi/noband) against baseline ... DIFFER
Checking pdfwrite of smdf.90441.102.pdf (ppmraw/72dpi/noband) against baseline ... DIFFER
Checking pdfwrite of smdf.90441.102.pdf (ppmraw/300dpi/noband) against baseline ... DIFFER
Checking pdfwrite of smdf.90441.102.pdf (pkmraw/300dpi/noband) against baseline ... DIFFER
Checking pdfwrite of test.pdf (ppmraw/72dpi/noband) against baseline ... DIFFER
Checking pdfwrite of test.pdf (ppmraw/300dpi/noband) against baseline ... DIFFER
Checking pdfwrite of test.pdf (pkmraw/300dpi/noband) against baseline ... DIFFER
Checking pdfwrite of test2.pdf (ppmraw/72dpi/noband) against baseline ... DIFFER
Checking pdfwrite of textsavematrix.pdf (ppmraw/72dpi/noband) against baseline ... DIFFER
Checking pdfwrite of textsavematrix.pdf (ppmraw/300dpi/noband) against baseline ... DIFFER
Checking pdfwrite of textsavematrix.pdf (pkmraw/300dpi/noband) against baseline ... DIFFER
Checking pdfwrite of a.pdf (ppmraw/72dpi/noband) against baseline ... DIFFER
Checking pdfwrite of a.pdf (ppmraw/300dpi/noband) against baseline ... DIFFER
Checking pdfwrite of a.pdf (pkmraw/300dpi/noband) against baseline ... DIFFER
Checking pdfwrite of CAT_LOGO.ps (ppmraw/72dpi/noband) against baseline ... DIFFER
Checking pdfwrite of CAT_LOGO.ps (ppmraw/300dpi/noband) against baseline ... DIFFER
Checking pdfwrite of CAT_LOGO.ps (pkmraw/300dpi/noband) against baseline ... DIFFER
Checking pdfwrite of Altona-Testsuite_p2_S_x3.pdf (ppmraw/72dpi/noband) against baseline ... ERROR
Checking pdfwrite of Altona-Testsuite_p2_S_x3.pdf (ppmraw/300dpi/noband) against baseline ... ERROR
Checking pdfwrite of Altona-Testsuite_p2_S_x3.pdf (pkmraw/300dpi/noband) against baseline ... ERROR
Checking pdfwrite of Altona.Page_3.2002-09-27.pdf (ppmraw/72dpi/noband) against baseline ... ERROR
Checking pdfwrite of Altona.Page_3.2002-09-27.pdf (ppmraw/300dpi/noband) against baseline ... ERROR
Checking pdfwrite of Altona.Page_3.2002-09-27.pdf (pkmraw/300dpi/noband) against baseline ... ERROR
Checking pdfwrite of S2_Digitalproof-Forum_circles.pdf (ppmraw/72dpi/noband) against baseline ... ERROR
Checking pdfwrite of S2_Digitalproof-Forum_circles.pdf (ppmraw/300dpi/noband) against baseline ... ERROR
Checking pdfwrite of S2_Digitalproof-Forum_circles.pdf (pkmraw/300dpi/noband) against baseline ... ERROR
Checking pdfwrite of S2_Digitalproof-Forum_x3k.pdf (ppmraw/72dpi/noband) against baseline ... ERROR
Checking pdfwrite of S2_Digitalproof-Forum_x3k.pdf (ppmraw/300dpi/noband) against baseline ... ERROR
Checking pdfwrite of S2_Digitalproof-Forum_x3k.pdf (pkmraw/300dpi/noband) against baseline ... ERROR
Checking pdfwrite of Testform.v1.0.2.pdf (ppmraw/72dpi/noband) against baseline ... ERROR
Checking pdfwrite of Testform.v1.0.2.pdf (ppmraw/300dpi/noband) against baseline ... ERROR
Checking pdfwrite of Testform.v1.0.2.pdf (pkmraw/300dpi/noband) against baseline ... ERROR
Checking pdfwrite of Es001-01.pdf (ppmraw/72dpi/noband) against baseline ... DIFFER
Checking pdfwrite of Es001-01.pdf (ppmraw/300dpi/noband) against baseline ... DIFFER
Checking pdfwrite of Es001-01.pdf (pkmraw/300dpi/noband) against baseline ... DIFFER
Checking pdfwrite of alphabet.ps (ppmraw/72dpi/noband) against baseline ... DIFFER
Checking pdfwrite of doretree.ps (ppmraw/300dpi/noband) against baseline ... DIFFER
Checking pdfwrite of doretree.ps (pkmraw/300dpi/noband) against baseline ... DIFFER
Checking pdfwrite of waterfal.ps (ppmraw/72dpi/noband) against baseline ... DIFFER
Checking pdfwrite of waterfal.ps (ppmraw/300dpi/noband) against baseline ... DIFFER
Checking pdfwrite of waterfal.ps (pkmraw/300dpi/noband) against baseline ... DIFFER

======================================================================
ERROR: Checking S2_Digitalproof-Forum_circles.pdf (pbmraw/72dpi/noband) against baseline
----------------------------------------------------------------------
Traceback (most recent call last):
  File "/home/regression/regression/gstestgs.py", line 158, in runTest
    self.assertEqual(sum, gssum.get_sum(file), 'md5sum did not match baseline (' + file + ') for file: ' + self.file)
  File "/home/regression/regression/gssum.py", line 43, in get_sum
    sum = db[file]
KeyError: S2_Digitalproof-Forum_circles.pdf.pbmraw.72.0
======================================================================
ERROR: Checking S2_Digitalproof-Forum_circles.pdf (pbmraw/72dpi/banded) against baseline
----------------------------------------------------------------------
Traceback (most recent call last):
  File "/home/regression/regression/gstestgs.py", line 158, in runTest
    self.assertEqual(sum, gssum.get_sum(file), 'md5sum did not match baseline (' + file + ') for file: ' + self.file)
  File "/home/regression/regression/gssum.py", line 43, in get_sum
    sum = db[file]
KeyError: S2_Digitalproof-Forum_circles.pdf.pbmraw.72.1
======================================================================
ERROR: Checking S2_Digitalproof-Forum_circles.pdf (pbmraw/300dpi/noband) against baseline
----------------------------------------------------------------------
Traceback (most recent call last):
  File "/home/regression/regression/gstestgs.py", line 158, in runTest
    self.assertEqual(sum, gssum.get_sum(file), 'md5sum did not match baseline (' + file + ') for file: ' + self.file)
  File "/home/regression/regression/gssum.py", line 43, in get_sum
    sum = db[file]
KeyError: S2_Digitalproof-Forum_circles.pdf.pbmraw.300.0
======================================================================
ERROR: Checking S2_Digitalproof-Forum_circles.pdf (pbmraw/300dpi/banded) against baseline
----------------------------------------------------------------------
Traceback (most recent call last):
  File "/home/regression/regression/gstestgs.py", line 158, in runTest
    self.assertEqual(sum, gssum.get_sum(file), 'md5sum did not match baseline (' + file + ') for file: ' + self.file)
  File "/home/regression/regression/gssum.py", line 43, in get_sum
    sum = db[file]
KeyError: S2_Digitalproof-Forum_circles.pdf.pbmraw.300.1
======================================================================
ERROR: Checking S2_Digitalproof-Forum_circles.pdf (pgmraw/72dpi/noband) against baseline
----------------------------------------------------------------------
Traceback (most recent call last):
  File "/home/regression/regression/gstestgs.py", line 158, in runTest
    self.assertEqual(sum, gssum.get_sum(file), 'md5sum did not match baseline (' + file + ') for file: ' + self.file)
  File "/home/regression/regression/gssum.py", line 43, in get_sum
    sum = db[file]
KeyError: S2_Digitalproof-Forum_circles.pdf.pgmraw.72.0
======================================================================
ERROR: Checking S2_Digitalproof-Forum_circles.pdf (pgmraw/72dpi/banded) against baseline
----------------------------------------------------------------------
Traceback (most recent call last):
  File "/home/regression/regression/gstestgs.py", line 158, in runTest
    self.assertEqual(sum, gssum.get_sum(file), 'md5sum did not match baseline (' + file + ') for file: ' + self.file)
  File "/home/regression/regression/gssum.py", line 43, in get_sum
    sum = db[file]
KeyError: S2_Digitalproof-Forum_circles.pdf.pgmraw.72.1
======================================================================
ERROR: Checking S2_Digitalproof-Forum_circles.pdf (pgmraw/300dpi/noband) against baseline
----------------------------------------------------------------------
Traceback (most recent call last):
  File "/home/regression/regression/gstestgs.py", line 158, in runTest
    self.assertEqual(sum, gssum.get_sum(file), 'md5sum did not match baseline (' + file + ') for file: ' + self.file)
  File "/home/regression/regression/gssum.py", line 43, in get_sum
    sum = db[file]
KeyError: S2_Digitalproof-Forum_circles.pdf.pgmraw.300.0
======================================================================
ERROR: Checking S2_Digitalproof-Forum_circles.pdf (pgmraw/300dpi/banded) against baseline
----------------------------------------------------------------------
Traceback (most recent call last):
  File "/home/regression/regression/gstestgs.py", line 158, in runTest
    self.assertEqual(sum, gssum.get_sum(file), 'md5sum did not match baseline (' + file + ') for file: ' + self.file)
  File "/home/regression/regression/gssum.py", line 43, in get_sum
    sum = db[file]
KeyError: S2_Digitalproof-Forum_circles.pdf.pgmraw.300.1
======================================================================
ERROR: Checking S2_Digitalproof-Forum_circles.pdf (ppmraw/72dpi/noband) against baseline
----------------------------------------------------------------------
Traceback (most recent call last):
  File "/home/regression/regression/gstestgs.py", line 158, in runTest
    self.assertEqual(sum, gssum.get_sum(file), 'md5sum did not match baseline (' + file + ') for file: ' + self.file)
  File "/home/regression/regression/gssum.py", line 43, in get_sum
    sum = db[file]
KeyError: S2_Digitalproof-Forum_circles.pdf.ppmraw.72.0
======================================================================
ERROR: Checking S2_Digitalproof-Forum_circles.pdf (ppmraw/72dpi/banded) against baseline
----------------------------------------------------------------------
Traceback (most recent call last):
  File "/home/regression/regression/gstestgs.py", line 158, in runTest
    self.assertEqual(sum, gssum.get_sum(file), 'md5sum did not match baseline (' + file + ') for file: ' + self.file)
  File "/home/regression/regression/gssum.py", line 43, in get_sum
    sum = db[file]
KeyError: S2_Digitalproof-Forum_circles.pdf.ppmraw.72.1
======================================================================
ERROR: Checking S2_Digitalproof-Forum_circles.pdf (ppmraw/300dpi/noband) against baseline
----------------------------------------------------------------------
Traceback (most recent call last):
  File "/home/regression/regression/gstestgs.py", line 158, in runTest
    self.assertEqual(sum, gssum.get_sum(file), 'md5sum did not match baseline (' + file + ') for file: ' + self.file)
  File "/home/regression/regression/gssum.py", line 43, in get_sum
    sum = db[file]
KeyError: S2_Digitalproof-Forum_circles.pdf.ppmraw.300.0
======================================================================
ERROR: Checking S2_Digitalproof-Forum_circles.pdf (ppmraw/300dpi/banded) against baseline
----------------------------------------------------------------------
Traceback (most recent call last):
  File "/home/regression/regression/gstestgs.py", line 158, in runTest
    self.assertEqual(sum, gssum.get_sum(file), 'md5sum did not match baseline (' + file + ') for file: ' + self.file)
  File "/home/regression/regression/gssum.py", line 43, in get_sum
    sum = db[file]
KeyError: S2_Digitalproof-Forum_circles.pdf.ppmraw.300.1
======================================================================
ERROR: Checking S2_Digitalproof-Forum_circles.pdf (pkmraw/72dpi/noband) against baseline
----------------------------------------------------------------------
Traceback (most recent call last):
  File "/home/regression/regression/gstestgs.py", line 158, in runTest
    self.assertEqual(sum, gssum.get_sum(file), 'md5sum did not match baseline (' + file + ') for file: ' + self.file)
  File "/home/regression/regression/gssum.py", line 43, in get_sum
    sum = db[file]
KeyError: S2_Digitalproof-Forum_circles.pdf.pkmraw.72.0
======================================================================
ERROR: Checking S2_Digitalproof-Forum_circles.pdf (pkmraw/72dpi/banded) against baseline
----------------------------------------------------------------------
Traceback (most recent call last):
  File "/home/regression/regression/gstestgs.py", line 158, in runTest
    self.assertEqual(sum, gssum.get_sum(file), 'md5sum did not match baseline (' + file + ') for file: ' + self.file)
  File "/home/regression/regression/gssum.py", line 43, in get_sum
    sum = db[file]
KeyError: S2_Digitalproof-Forum_circles.pdf.pkmraw.72.1
======================================================================
ERROR: Checking S2_Digitalproof-Forum_circles.pdf (pkmraw/300dpi/noband) against baseline
----------------------------------------------------------------------
Traceback (most recent call last):
  File "/home/regression/regression/gstestgs.py", line 158, in runTest
    self.assertEqual(sum, gssum.get_sum(file), 'md5sum did not match baseline (' + file + ') for file: ' + self.file)
  File "/home/regression/regression/gssum.py", line 43, in get_sum
    sum = db[file]
KeyError: S2_Digitalproof-Forum_circles.pdf.pkmraw.300.0
======================================================================
ERROR: Checking S2_Digitalproof-Forum_circles.pdf (pkmraw/300dpi/banded) against baseline
----------------------------------------------------------------------
Traceback (most recent call last):
  File "/home/regression/regression/gstestgs.py", line 158, in runTest
    self.assertEqual(sum, gssum.get_sum(file), 'md5sum did not match baseline (' + file + ') for file: ' + self.file)
  File "/home/regression/regression/gssum.py", line 43, in get_sum
    sum = db[file]
KeyError: S2_Digitalproof-Forum_circles.pdf.pkmraw.300.1
======================================================================
ERROR: Checking ridt91.eps (pbmraw/72dpi/noband) against baseline
----------------------------------------------------------------------
Traceback (most recent call last):
  File "/home/regression/regression/gstestgs.py", line 151, in runTest
    sum = gssum.make_sum(file)
  File "/home/regression/regression/gssum.py", line 52, in make_sum
    mode = os.stat(file)[ST_MODE]
OSError: [Errno 2] No such file or directory: 'ridt91.eps.pbmraw.72.0'
======================================================================
ERROR: Checking ridt91.eps (pbmraw/72dpi/banded) against baseline
----------------------------------------------------------------------
Traceback (most recent call last):
  File "/home/regression/regression/gstestgs.py", line 151, in runTest
    sum = gssum.make_sum(file)
  File "/home/regression/regression/gssum.py", line 52, in make_sum
    mode = os.stat(file)[ST_MODE]
OSError: [Errno 2] No such file or directory: 'ridt91.eps.pbmraw.72.1'
======================================================================
ERROR: Checking ridt91.eps (pbmraw/300dpi/noband) against baseline
----------------------------------------------------------------------
Traceback (most recent call last):
  File "/home/regression/regression/gstestgs.py", line 151, in runTest
    sum = gssum.make_sum(file)
  File "/home/regression/regression/gssum.py", line 52, in make_sum
    mode = os.stat(file)[ST_MODE]
OSError: [Errno 2] No such file or directory: 'ridt91.eps.pbmraw.300.0'
======================================================================
ERROR: Checking ridt91.eps (pbmraw/300dpi/banded) against baseline
----------------------------------------------------------------------
Traceback (most recent call last):
  File "/home/regression/regression/gstestgs.py", line 151, in runTest
    sum = gssum.make_sum(file)
  File "/home/regression/regression/gssum.py", line 52, in make_sum
    mode = os.stat(file)[ST_MODE]
OSError: [Errno 2] No such file or directory: 'ridt91.eps.pbmraw.300.1'
======================================================================
ERROR: Checking ridt91.eps (pgmraw/72dpi/noband) against baseline
----------------------------------------------------------------------
Traceback (most recent call last):
  File "/home/regression/regression/gstestgs.py", line 151, in runTest
    sum = gssum.make_sum(file)
  File "/home/regression/regression/gssum.py", line 52, in make_sum
    mode = os.stat(file)[ST_MODE]
OSError: [Errno 2] No such file or directory: 'ridt91.eps.pgmraw.72.0'
======================================================================
ERROR: Checking ridt91.eps (pgmraw/72dpi/banded) against baseline
----------------------------------------------------------------------
Traceback (most recent call last):
  File "/home/regression/regression/gstestgs.py", line 151, in runTest
    sum = gssum.make_sum(file)
  File "/home/regression/regression/gssum.py", line 52, in make_sum
    mode = os.stat(file)[ST_MODE]
OSError: [Errno 2] No such file or directory: 'ridt91.eps.pgmraw.72.1'
======================================================================
ERROR: Checking ridt91.eps (pgmraw/300dpi/noband) against baseline
----------------------------------------------------------------------
Traceback (most recent call last):
  File "/home/regression/regression/gstestgs.py", line 151, in runTest
    sum = gssum.make_sum(file)
  File "/home/regression/regression/gssum.py", line 52, in make_sum
    mode = os.stat(file)[ST_MODE]
OSError: [Errno 2] No such file or directory: 'ridt91.eps.pgmraw.300.0'
======================================================================
ERROR: Checking ridt91.eps (pgmraw/300dpi/banded) against baseline
----------------------------------------------------------------------
Traceback (most recent call last):
  File "/home/regression/regression/gstestgs.py", line 151, in runTest
    sum = gssum.make_sum(file)
  File "/home/regression/regression/gssum.py", line 52, in make_sum
    mode = os.stat(file)[ST_MODE]
OSError: [Errno 2] No such file or directory: 'ridt91.eps.pgmraw.300.1'
======================================================================
ERROR: Checking ridt91.eps (ppmraw/72dpi/noband) against baseline
----------------------------------------------------------------------
Traceback (most recent call last):
  File "/home/regression/regression/gstestgs.py", line 151, in runTest
    sum = gssum.make_sum(file)
  File "/home/regression/regression/gssum.py", line 52, in make_sum
    mode = os.stat(file)[ST_MODE]
OSError: [Errno 2] No such file or directory: 'ridt91.eps.ppmraw.72.0'
======================================================================
ERROR: Checking ridt91.eps (ppmraw/72dpi/banded) against baseline
----------------------------------------------------------------------
Traceback (most recent call last):
  File "/home/regression/regression/gstestgs.py", line 151, in runTest
    sum = gssum.make_sum(file)
  File "/home/regression/regression/gssum.py", line 52, in make_sum
    mode = os.stat(file)[ST_MODE]
OSError: [Errno 2] No such file or directory: 'ridt91.eps.ppmraw.72.1'
======================================================================
ERROR: Checking ridt91.eps (ppmraw/300dpi/noband) against baseline
----------------------------------------------------------------------
Traceback (most recent call last):
  File "/home/regression/regression/gstestgs.py", line 151, in runTest
    sum = gssum.make_sum(file)
  File "/home/regression/regression/gssum.py", line 52, in make_sum
    mode = os.stat(file)[ST_MODE]
OSError: [Errno 2] No such file or directory: 'ridt91.eps.ppmraw.300.0'
======================================================================
ERROR: Checking ridt91.eps (ppmraw/300dpi/banded) against baseline
----------------------------------------------------------------------
Traceback (most recent call last):
  File "/home/regression/regression/gstestgs.py", line 151, in runTest
    sum = gssum.make_sum(file)
  File "/home/regression/regression/gssum.py", line 52, in make_sum
    mode = os.stat(file)[ST_MODE]
OSError: [Errno 2] No such file or directory: 'ridt91.eps.ppmraw.300.1'
======================================================================
ERROR: Checking ridt91.eps (pkmraw/72dpi/noband) against baseline
----------------------------------------------------------------------
Traceback (most recent call last):
  File "/home/regression/regression/gstestgs.py", line 151, in runTest
    sum = gssum.make_sum(file)
  File "/home/regression/regression/gssum.py", line 52, in make_sum
    mode = os.stat(file)[ST_MODE]
OSError: [Errno 2] No such file or directory: 'ridt91.eps.pkmraw.72.0'
======================================================================
ERROR: Checking ridt91.eps (pkmraw/72dpi/banded) against baseline
----------------------------------------------------------------------
Traceback (most recent call last):
  File "/home/regression/regression/gstestgs.py", line 151, in runTest
    sum = gssum.make_sum(file)
  File "/home/regression/regression/gssum.py", line 52, in make_sum
    mode = os.stat(file)[ST_MODE]
OSError: [Errno 2] No such file or directory: 'ridt91.eps.pkmraw.72.1'
======================================================================
ERROR: Checking ridt91.eps (pkmraw/300dpi/noband) against baseline
----------------------------------------------------------------------
Traceback (most recent call last):
  File "/home/regression/regression/gstestgs.py", line 151, in runTest
    sum = gssum.make_sum(file)
  File "/home/regression/regression/gssum.py", line 52, in make_sum
    mode = os.stat(file)[ST_MODE]
OSError: [Errno 2] No such file or directory: 'ridt91.eps.pkmraw.300.0'
======================================================================
ERROR: Checking ridt91.eps (pkmraw/300dpi/banded) against baseline
----------------------------------------------------------------------
Traceback (most recent call last):
  File "/home/regression/regression/gstestgs.py", line 151, in runTest
    sum = gssum.make_sum(file)
  File "/home/regression/regression/gssum.py", line 52, in make_sum
    mode = os.stat(file)[ST_MODE]
OSError: [Errno 2] No such file or directory: 'ridt91.eps.pkmraw.300.1'
======================================================================
ERROR: Checking pdfwrite of Altona-Testsuite_p2_S_x3.pdf (ppmraw/72dpi/noband) against baseline
----------------------------------------------------------------------
Traceback (most recent call last):
  File "/home/regression/regression/gscheck_pdfwrite.py", line 79, in runTest
    self.assertEqual(sum, gssum.get_sum(file2), "md5sum did not match baseline (" + file2 + ") for file: " + self.file)
  File "/home/regression/regression/gssum.py", line 43, in get_sum
    sum = db[file]
KeyError: Altona-Testsuite_p2_S_x3.pdf.pdf.ppmraw.72.0
======================================================================
ERROR: Checking pdfwrite of Altona-Testsuite_p2_S_x3.pdf (ppmraw/300dpi/noband) against baseline
----------------------------------------------------------------------
Traceback (most recent call last):
  File "/home/regression/regression/gscheck_pdfwrite.py", line 79, in runTest
    self.assertEqual(sum, gssum.get_sum(file2), "md5sum did not match baseline (" + file2 + ") for file: " + self.file)
  File "/home/regression/regression/gssum.py", line 43, in get_sum
    sum = db[file]
KeyError: Altona-Testsuite_p2_S_x3.pdf.pdf.ppmraw.300.0
======================================================================
ERROR: Checking pdfwrite of Altona-Testsuite_p2_S_x3.pdf (pkmraw/300dpi/noband) against baseline
----------------------------------------------------------------------
Traceback (most recent call last):
  File "/home/regression/regression/gscheck_pdfwrite.py", line 79, in runTest
    self.assertEqual(sum, gssum.get_sum(file2), "md5sum did not match baseline (" + file2 + ") for file: " + self.file)
  File "/home/regression/regression/gssum.py", line 43, in get_sum
    sum = db[file]
KeyError: Altona-Testsuite_p2_S_x3.pdf.pdf.pkmraw.300.0
======================================================================
ERROR: Checking pdfwrite of Altona.Page_3.2002-09-27.pdf (ppmraw/72dpi/noband) against baseline
----------------------------------------------------------------------
Traceback (most recent call last):
  File "/home/regression/regression/gscheck_pdfwrite.py", line 79, in runTest
    self.assertEqual(sum, gssum.get_sum(file2), "md5sum did not match baseline (" + file2 + ") for file: " + self.file)
  File "/home/regression/regression/gssum.py", line 43, in get_sum
    sum = db[file]
KeyError: Altona.Page_3.2002-09-27.pdf.pdf.ppmraw.72.0
======================================================================
ERROR: Checking pdfwrite of Altona.Page_3.2002-09-27.pdf (ppmraw/300dpi/noband) against baseline
----------------------------------------------------------------------
Traceback (most recent call last):
  File "/home/regression/regression/gscheck_pdfwrite.py", line 79, in runTest
    self.assertEqual(sum, gssum.get_sum(file2), "md5sum did not match baseline (" + file2 + ") for file: " + self.file)
  File "/home/regression/regression/gssum.py", line 43, in get_sum
    sum = db[file]
KeyError: Altona.Page_3.2002-09-27.pdf.pdf.ppmraw.300.0
======================================================================
ERROR: Checking pdfwrite of Altona.Page_3.2002-09-27.pdf (pkmraw/300dpi/noband) against baseline
----------------------------------------------------------------------
Traceback (most recent call last):
  File "/home/regression/regression/gscheck_pdfwrite.py", line 79, in runTest
    self.assertEqual(sum, gssum.get_sum(file2), "md5sum did not match baseline (" + file2 + ") for file: " + self.file)
  File "/home/regression/regression/gssum.py", line 43, in get_sum
    sum = db[file]
KeyError: Altona.Page_3.2002-09-27.pdf.pdf.pkmraw.300.0
======================================================================
ERROR: Checking pdfwrite of S2_Digitalproof-Forum_circles.pdf (ppmraw/72dpi/noband) against baseline
----------------------------------------------------------------------
Traceback (most recent call last):
  File "/home/regression/regression/gscheck_pdfwrite.py", line 79, in runTest
    self.assertEqual(sum, gssum.get_sum(file2), "md5sum did not match baseline (" + file2 + ") for file: " + self.file)
  File "/home/regression/regression/gssum.py", line 43, in get_sum
    sum = db[file]
KeyError: S2_Digitalproof-Forum_circles.pdf.pdf.ppmraw.72.0
======================================================================
ERROR: Checking pdfwrite of S2_Digitalproof-Forum_circles.pdf (ppmraw/300dpi/noband) against baseline
----------------------------------------------------------------------
Traceback (most recent call last):
  File "/home/regression/regression/gscheck_pdfwrite.py", line 79, in runTest
    self.assertEqual(sum, gssum.get_sum(file2), "md5sum did not match baseline (" + file2 + ") for file: " + self.file)
  File "/home/regression/regression/gssum.py", line 43, in get_sum
    sum = db[file]
KeyError: S2_Digitalproof-Forum_circles.pdf.pdf.ppmraw.300.0
======================================================================
ERROR: Checking pdfwrite of S2_Digitalproof-Forum_circles.pdf (pkmraw/300dpi/noband) against baseline
----------------------------------------------------------------------
Traceback (most recent call last):
  File "/home/regression/regression/gscheck_pdfwrite.py", line 79, in runTest
    self.assertEqual(sum, gssum.get_sum(file2), "md5sum did not match baseline (" + file2 + ") for file: " + self.file)
  File "/home/regression/regression/gssum.py", line 43, in get_sum
    sum = db[file]
KeyError: S2_Digitalproof-Forum_circles.pdf.pdf.pkmraw.300.0
======================================================================
ERROR: Checking pdfwrite of S2_Digitalproof-Forum_x3k.pdf (ppmraw/72dpi/noband) against baseline
----------------------------------------------------------------------
Traceback (most recent call last):
  File "/home/regression/regression/gscheck_pdfwrite.py", line 79, in runTest
    self.assertEqual(sum, gssum.get_sum(file2), "md5sum did not match baseline (" + file2 + ") for file: " + self.file)
  File "/home/regression/regression/gssum.py", line 43, in get_sum
    sum = db[file]
KeyError: S2_Digitalproof-Forum_x3k.pdf.pdf.ppmraw.72.0
======================================================================
ERROR: Checking pdfwrite of S2_Digitalproof-Forum_x3k.pdf (ppmraw/300dpi/noband) against baseline
----------------------------------------------------------------------
Traceback (most recent call last):
  File "/home/regression/regression/gscheck_pdfwrite.py", line 79, in runTest
    self.assertEqual(sum, gssum.get_sum(file2), "md5sum did not match baseline (" + file2 + ") for file: " + self.file)
  File "/home/regression/regression/gssum.py", line 43, in get_sum
    sum = db[file]
KeyError: S2_Digitalproof-Forum_x3k.pdf.pdf.ppmraw.300.0
======================================================================
ERROR: Checking pdfwrite of S2_Digitalproof-Forum_x3k.pdf (pkmraw/300dpi/noband) against baseline
----------------------------------------------------------------------
Traceback (most recent call last):
  File "/home/regression/regression/gscheck_pdfwrite.py", line 79, in runTest
    self.assertEqual(sum, gssum.get_sum(file2), "md5sum did not match baseline (" + file2 + ") for file: " + self.file)
  File "/home/regression/regression/gssum.py", line 43, in get_sum
    sum = db[file]
KeyError: S2_Digitalproof-Forum_x3k.pdf.pdf.pkmraw.300.0
======================================================================
ERROR: Checking pdfwrite of Testform.v1.0.2.pdf (ppmraw/72dpi/noband) against baseline
----------------------------------------------------------------------
Traceback (most recent call last):
  File "/home/regression/regression/gscheck_pdfwrite.py", line 79, in runTest
    self.assertEqual(sum, gssum.get_sum(file2), "md5sum did not match baseline (" + file2 + ") for file: " + self.file)
  File "/home/regression/regression/gssum.py", line 43, in get_sum
    sum = db[file]
KeyError: Testform.v1.0.2.pdf.pdf.ppmraw.72.0
======================================================================
ERROR: Checking pdfwrite of Testform.v1.0.2.pdf (ppmraw/300dpi/noband) against baseline
----------------------------------------------------------------------
Traceback (most recent call last):
  File "/home/regression/regression/gscheck_pdfwrite.py", line 79, in runTest
    self.assertEqual(sum, gssum.get_sum(file2), "md5sum did not match baseline (" + file2 + ") for file: " + self.file)
  File "/home/regression/regression/gssum.py", line 43, in get_sum
    sum = db[file]
KeyError: Testform.v1.0.2.pdf.pdf.ppmraw.300.0
======================================================================
ERROR: Checking pdfwrite of Testform.v1.0.2.pdf (pkmraw/300dpi/noband) against baseline
----------------------------------------------------------------------
Traceback (most recent call last):
  File "/home/regression/regression/gscheck_pdfwrite.py", line 79, in runTest
    self.assertEqual(sum, gssum.get_sum(file2), "md5sum did not match baseline (" + file2 + ") for file: " + self.file)
  File "/home/regression/regression/gssum.py", line 43, in get_sum
    sum = db[file]
KeyError: Testform.v1.0.2.pdf.pdf.pkmraw.300.0
======================================================================
FAIL: Checking Fixed_Original.pdf (pgmraw/300dpi/noband) against baseline
----------------------------------------------------------------------
md5sum did not match baseline (Fixed_Original.pdf.pgmraw.300.0) for file: /home/regression/comparefiles/Fixed_Original.pdf
======================================================================
FAIL: Checking Fixed_Original.pdf (pgmraw/300dpi/banded) against baseline
----------------------------------------------------------------------
md5sum did not match baseline (Fixed_Original.pdf.pgmraw.300.1) for file: /home/regression/comparefiles/Fixed_Original.pdf
======================================================================
FAIL: Checking Fixed_Original.pdf (ppmraw/300dpi/noband) against baseline
----------------------------------------------------------------------
md5sum did not match baseline (Fixed_Original.pdf.ppmraw.300.0) for file: /home/regression/comparefiles/Fixed_Original.pdf
======================================================================
FAIL: Checking Fixed_Original.pdf (ppmraw/300dpi/banded) against baseline
----------------------------------------------------------------------
md5sum did not match baseline (Fixed_Original.pdf.ppmraw.300.1) for file: /home/regression/comparefiles/Fixed_Original.pdf
======================================================================
FAIL: Checking Altona-Testsuite_p2_S_x3.pdf (pbmraw/72dpi/noband) against baseline
----------------------------------------------------------------------
md5sum did not match baseline (Altona-Testsuite_p2_S_x3.pdf.pbmraw.72.0) for file: /home/regression/comparefiles/Altona-Testsuite_p2_S_x3.pdf
======================================================================
FAIL: Checking Altona-Testsuite_p2_S_x3.pdf (pbmraw/72dpi/banded) against baseline
----------------------------------------------------------------------
md5sum did not match baseline (Altona-Testsuite_p2_S_x3.pdf.pbmraw.72.1) for file: /home/regression/comparefiles/Altona-Testsuite_p2_S_x3.pdf
======================================================================
FAIL: Checking Altona-Testsuite_p2_S_x3.pdf (pbmraw/300dpi/noband) against baseline
----------------------------------------------------------------------
md5sum did not match baseline (Altona-Testsuite_p2_S_x3.pdf.pbmraw.300.0) for file: /home/regression/comparefiles/Altona-Testsuite_p2_S_x3.pdf
======================================================================
FAIL: Checking Altona-Testsuite_p2_S_x3.pdf (pbmraw/300dpi/banded) against baseline
----------------------------------------------------------------------
md5sum did not match baseline (Altona-Testsuite_p2_S_x3.pdf.pbmraw.300.1) for file: /home/regression/comparefiles/Altona-Testsuite_p2_S_x3.pdf
======================================================================
FAIL: Checking Altona-Testsuite_p2_S_x3.pdf (pgmraw/72dpi/noband) against baseline
----------------------------------------------------------------------
md5sum did not match baseline (Altona-Testsuite_p2_S_x3.pdf.pgmraw.72.0) for file: /home/regression/comparefiles/Altona-Testsuite_p2_S_x3.pdf
======================================================================
FAIL: Checking Altona-Testsuite_p2_S_x3.pdf (pgmraw/72dpi/banded) against baseline
----------------------------------------------------------------------
md5sum did not match baseline (Altona-Testsuite_p2_S_x3.pdf.pgmraw.72.1) for file: /home/regression/comparefiles/Altona-Testsuite_p2_S_x3.pdf
======================================================================
FAIL: Checking Altona-Testsuite_p2_S_x3.pdf (pgmraw/300dpi/noband) against baseline
----------------------------------------------------------------------
md5sum did not match baseline (Altona-Testsuite_p2_S_x3.pdf.pgmraw.300.0) for file: /home/regression/comparefiles/Altona-Testsuite_p2_S_x3.pdf
======================================================================
FAIL: Checking Altona-Testsuite_p2_S_x3.pdf (pgmraw/300dpi/banded) against baseline
----------------------------------------------------------------------
md5sum did not match baseline (Altona-Testsuite_p2_S_x3.pdf.pgmraw.300.1) for file: /home/regression/comparefiles/Altona-Testsuite_p2_S_x3.pdf
======================================================================
FAIL: Checking Altona-Testsuite_p2_S_x3.pdf (ppmraw/72dpi/noband) against baseline
----------------------------------------------------------------------
md5sum did not match baseline (Altona-Testsuite_p2_S_x3.pdf.ppmraw.72.0) for file: /home/regression/comparefiles/Altona-Testsuite_p2_S_x3.pdf
======================================================================
FAIL: Checking Altona-Testsuite_p2_S_x3.pdf (ppmraw/72dpi/banded) against baseline
----------------------------------------------------------------------
md5sum did not match baseline (Altona-Testsuite_p2_S_x3.pdf.ppmraw.72.1) for file: /home/regression/comparefiles/Altona-Testsuite_p2_S_x3.pdf
======================================================================
FAIL: Checking Altona-Testsuite_p2_S_x3.pdf (ppmraw/300dpi/noband) against baseline
----------------------------------------------------------------------
md5sum did not match baseline (Altona-Testsuite_p2_S_x3.pdf.ppmraw.300.0) for file: /home/regression/comparefiles/Altona-Testsuite_p2_S_x3.pdf
======================================================================
FAIL: Checking Altona-Testsuite_p2_S_x3.pdf (ppmraw/300dpi/banded) against baseline
----------------------------------------------------------------------
md5sum did not match baseline (Altona-Testsuite_p2_S_x3.pdf.ppmraw.300.1) for file: /home/regression/comparefiles/Altona-Testsuite_p2_S_x3.pdf
======================================================================
FAIL: Checking Altona-Testsuite_p2_S_x3.pdf (pkmraw/72dpi/noband) against baseline
----------------------------------------------------------------------
md5sum did not match baseline (Altona-Testsuite_p2_S_x3.pdf.pkmraw.72.0) for file: /home/regression/comparefiles/Altona-Testsuite_p2_S_x3.pdf
======================================================================
FAIL: Checking Altona-Testsuite_p2_S_x3.pdf (pkmraw/72dpi/banded) against baseline
----------------------------------------------------------------------
md5sum did not match baseline (Altona-Testsuite_p2_S_x3.pdf.pkmraw.72.1) for file: /home/regression/comparefiles/Altona-Testsuite_p2_S_x3.pdf
======================================================================
FAIL: Checking Altona-Testsuite_p2_S_x3.pdf (pkmraw/300dpi/noband) against baseline
----------------------------------------------------------------------
md5sum did not match baseline (Altona-Testsuite_p2_S_x3.pdf.pkmraw.300.0) for file: /home/regression/comparefiles/Altona-Testsuite_p2_S_x3.pdf
======================================================================
FAIL: Checking Altona-Testsuite_p2_S_x3.pdf (pkmraw/300dpi/banded) against baseline
----------------------------------------------------------------------
md5sum did not match baseline (Altona-Testsuite_p2_S_x3.pdf.pkmraw.300.1) for file: /home/regression/comparefiles/Altona-Testsuite_p2_S_x3.pdf
======================================================================
FAIL: Checking Altona.Page_3.2002-09-27.pdf (pbmraw/72dpi/noband) against baseline
----------------------------------------------------------------------
md5sum did not match baseline (Altona.Page_3.2002-09-27.pdf.pbmraw.72.0) for file: /home/regression/comparefiles/Altona.Page_3.2002-09-27.pdf
======================================================================
FAIL: Checking Altona.Page_3.2002-09-27.pdf (pbmraw/72dpi/banded) against baseline
----------------------------------------------------------------------
md5sum did not match baseline (Altona.Page_3.2002-09-27.pdf.pbmraw.72.1) for file: /home/regression/comparefiles/Altona.Page_3.2002-09-27.pdf
======================================================================
FAIL: Checking Altona.Page_3.2002-09-27.pdf (pbmraw/300dpi/noband) against baseline
----------------------------------------------------------------------
md5sum did not match baseline (Altona.Page_3.2002-09-27.pdf.pbmraw.300.0) for file: /home/regression/comparefiles/Altona.Page_3.2002-09-27.pdf
======================================================================
FAIL: Checking Altona.Page_3.2002-09-27.pdf (pbmraw/300dpi/banded) against baseline
----------------------------------------------------------------------
md5sum did not match baseline (Altona.Page_3.2002-09-27.pdf.pbmraw.300.1) for file: /home/regression/comparefiles/Altona.Page_3.2002-09-27.pdf
======================================================================
FAIL: Checking Altona.Page_3.2002-09-27.pdf (pgmraw/72dpi/noband) against baseline
----------------------------------------------------------------------
md5sum did not match baseline (Altona.Page_3.2002-09-27.pdf.pgmraw.72.0) for file: /home/regression/comparefiles/Altona.Page_3.2002-09-27.pdf
======================================================================
FAIL: Checking Altona.Page_3.2002-09-27.pdf (pgmraw/72dpi/banded) against baseline
----------------------------------------------------------------------
md5sum did not match baseline (Altona.Page_3.2002-09-27.pdf.pgmraw.72.1) for file: /home/regression/comparefiles/Altona.Page_3.2002-09-27.pdf
======================================================================
FAIL: Checking Altona.Page_3.2002-09-27.pdf (pgmraw/300dpi/noband) against baseline
----------------------------------------------------------------------
md5sum did not match baseline (Altona.Page_3.2002-09-27.pdf.pgmraw.300.0) for file: /home/regression/comparefiles/Altona.Page_3.2002-09-27.pdf
======================================================================
FAIL: Checking Altona.Page_3.2002-09-27.pdf (pgmraw/300dpi/banded) against baseline
----------------------------------------------------------------------
md5sum did not match baseline (Altona.Page_3.2002-09-27.pdf.pgmraw.300.1) for file: /home/regression/comparefiles/Altona.Page_3.2002-09-27.pdf
======================================================================
FAIL: Checking Altona.Page_3.2002-09-27.pdf (ppmraw/72dpi/noband) against baseline
----------------------------------------------------------------------
md5sum did not match baseline (Altona.Page_3.2002-09-27.pdf.ppmraw.72.0) for file: /home/regression/comparefiles/Altona.Page_3.2002-09-27.pdf
======================================================================
FAIL: Checking Altona.Page_3.2002-09-27.pdf (ppmraw/72dpi/banded) against baseline
----------------------------------------------------------------------
md5sum did not match baseline (Altona.Page_3.2002-09-27.pdf.ppmraw.72.1) for file: /home/regression/comparefiles/Altona.Page_3.2002-09-27.pdf
======================================================================
FAIL: Checking Altona.Page_3.2002-09-27.pdf (ppmraw/300dpi/noband) against baseline
----------------------------------------------------------------------
md5sum did not match baseline (Altona.Page_3.2002-09-27.pdf.ppmraw.300.0) for file: /home/regression/comparefiles/Altona.Page_3.2002-09-27.pdf
======================================================================
FAIL: Checking Altona.Page_3.2002-09-27.pdf (ppmraw/300dpi/banded) against baseline
----------------------------------------------------------------------
md5sum did not match baseline (Altona.Page_3.2002-09-27.pdf.ppmraw.300.1) for file: /home/regression/comparefiles/Altona.Page_3.2002-09-27.pdf
======================================================================
FAIL: Checking Altona.Page_3.2002-09-27.pdf (pkmraw/72dpi/noband) against baseline
----------------------------------------------------------------------
md5sum did not match baseline (Altona.Page_3.2002-09-27.pdf.pkmraw.72.0) for file: /home/regression/comparefiles/Altona.Page_3.2002-09-27.pdf
======================================================================
FAIL: Checking Altona.Page_3.2002-09-27.pdf (pkmraw/72dpi/banded) against baseline
----------------------------------------------------------------------
md5sum did not match baseline (Altona.Page_3.2002-09-27.pdf.pkmraw.72.1) for file: /home/regression/comparefiles/Altona.Page_3.2002-09-27.pdf
======================================================================
FAIL: Checking Altona.Page_3.2002-09-27.pdf (pkmraw/300dpi/noband) against baseline
----------------------------------------------------------------------
md5sum did not match baseline (Altona.Page_3.2002-09-27.pdf.pkmraw.300.0) for file: /home/regression/comparefiles/Altona.Page_3.2002-09-27.pdf
======================================================================
FAIL: Checking Altona.Page_3.2002-09-27.pdf (pkmraw/300dpi/banded) against baseline
----------------------------------------------------------------------
md5sum did not match baseline (Altona.Page_3.2002-09-27.pdf.pkmraw.300.1) for file: /home/regression/comparefiles/Altona.Page_3.2002-09-27.pdf
======================================================================
FAIL: Checking S2_Digitalproof-Forum_x3k.pdf (pbmraw/72dpi/noband) against baseline
----------------------------------------------------------------------
md5sum did not match baseline (S2_Digitalproof-Forum_x3k.pdf.pbmraw.72.0) for file: /home/regression/comparefiles/S2_Digitalproof-Forum_x3k.pdf
======================================================================
FAIL: Checking S2_Digitalproof-Forum_x3k.pdf (pbmraw/72dpi/banded) against baseline
----------------------------------------------------------------------
md5sum did not match baseline (S2_Digitalproof-Forum_x3k.pdf.pbmraw.72.1) for file: /home/regression/comparefiles/S2_Digitalproof-Forum_x3k.pdf
======================================================================
FAIL: Checking S2_Digitalproof-Forum_x3k.pdf (pbmraw/300dpi/noband) against baseline
----------------------------------------------------------------------
md5sum did not match baseline (S2_Digitalproof-Forum_x3k.pdf.pbmraw.300.0) for file: /home/regression/comparefiles/S2_Digitalproof-Forum_x3k.pdf
======================================================================
FAIL: Checking S2_Digitalproof-Forum_x3k.pdf (pbmraw/300dpi/banded) against baseline
----------------------------------------------------------------------
md5sum did not match baseline (S2_Digitalproof-Forum_x3k.pdf.pbmraw.300.1) for file: /home/regression/comparefiles/S2_Digitalproof-Forum_x3k.pdf
======================================================================
FAIL: Checking S2_Digitalproof-Forum_x3k.pdf (pgmraw/72dpi/noband) against baseline
----------------------------------------------------------------------
md5sum did not match baseline (S2_Digitalproof-Forum_x3k.pdf.pgmraw.72.0) for file: /home/regression/comparefiles/S2_Digitalproof-Forum_x3k.pdf
======================================================================
FAIL: Checking S2_Digitalproof-Forum_x3k.pdf (pgmraw/72dpi/banded) against baseline
----------------------------------------------------------------------
md5sum did not match baseline (S2_Digitalproof-Forum_x3k.pdf.pgmraw.72.1) for file: /home/regression/comparefiles/S2_Digitalproof-Forum_x3k.pdf
======================================================================
FAIL: Checking S2_Digitalproof-Forum_x3k.pdf (pgmraw/300dpi/noband) against baseline
----------------------------------------------------------------------
md5sum did not match baseline (S2_Digitalproof-Forum_x3k.pdf.pgmraw.300.0) for file: /home/regression/comparefiles/S2_Digitalproof-Forum_x3k.pdf
======================================================================
FAIL: Checking S2_Digitalproof-Forum_x3k.pdf (pgmraw/300dpi/banded) against baseline
----------------------------------------------------------------------
md5sum did not match baseline (S2_Digitalproof-Forum_x3k.pdf.pgmraw.300.1) for file: /home/regression/comparefiles/S2_Digitalproof-Forum_x3k.pdf
======================================================================
FAIL: Checking S2_Digitalproof-Forum_x3k.pdf (ppmraw/72dpi/noband) against baseline
----------------------------------------------------------------------
md5sum did not match baseline (S2_Digitalproof-Forum_x3k.pdf.ppmraw.72.0) for file: /home/regression/comparefiles/S2_Digitalproof-Forum_x3k.pdf
======================================================================
FAIL: Checking S2_Digitalproof-Forum_x3k.pdf (ppmraw/72dpi/banded) against baseline
----------------------------------------------------------------------
md5sum did not match baseline (S2_Digitalproof-Forum_x3k.pdf.ppmraw.72.1) for file: /home/regression/comparefiles/S2_Digitalproof-Forum_x3k.pdf
======================================================================
FAIL: Checking S2_Digitalproof-Forum_x3k.pdf (ppmraw/300dpi/noband) against baseline
----------------------------------------------------------------------
md5sum did not match baseline (S2_Digitalproof-Forum_x3k.pdf.ppmraw.300.0) for file: /home/regression/comparefiles/S2_Digitalproof-Forum_x3k.pdf
======================================================================
FAIL: Checking S2_Digitalproof-Forum_x3k.pdf (ppmraw/300dpi/banded) against baseline
----------------------------------------------------------------------
md5sum did not match baseline (S2_Digitalproof-Forum_x3k.pdf.ppmraw.300.1) for file: /home/regression/comparefiles/S2_Digitalproof-Forum_x3k.pdf
======================================================================
FAIL: Checking S2_Digitalproof-Forum_x3k.pdf (pkmraw/72dpi/noband) against baseline
----------------------------------------------------------------------
md5sum did not match baseline (S2_Digitalproof-Forum_x3k.pdf.pkmraw.72.0) for file: /home/regression/comparefiles/S2_Digitalproof-Forum_x3k.pdf
======================================================================
FAIL: Checking S2_Digitalproof-Forum_x3k.pdf (pkmraw/72dpi/banded) against baseline
----------------------------------------------------------------------
md5sum did not match baseline (S2_Digitalproof-Forum_x3k.pdf.pkmraw.72.1) for file: /home/regression/comparefiles/S2_Digitalproof-Forum_x3k.pdf
======================================================================
FAIL: Checking S2_Digitalproof-Forum_x3k.pdf (pkmraw/300dpi/noband) against baseline
----------------------------------------------------------------------
md5sum did not match baseline (S2_Digitalproof-Forum_x3k.pdf.pkmraw.300.0) for file: /home/regression/comparefiles/S2_Digitalproof-Forum_x3k.pdf
======================================================================
FAIL: Checking S2_Digitalproof-Forum_x3k.pdf (pkmraw/300dpi/banded) against baseline
----------------------------------------------------------------------
md5sum did not match baseline (S2_Digitalproof-Forum_x3k.pdf.pkmraw.300.1) for file: /home/regression/comparefiles/S2_Digitalproof-Forum_x3k.pdf
======================================================================
FAIL: Checking Testform.v1.0.2.pdf (pbmraw/72dpi/noband) against baseline
----------------------------------------------------------------------
md5sum did not match baseline (Testform.v1.0.2.pdf.pbmraw.72.0) for file: /home/regression/comparefiles/Testform.v1.0.2.pdf
======================================================================
FAIL: Checking Testform.v1.0.2.pdf (pbmraw/72dpi/banded) against baseline
----------------------------------------------------------------------
md5sum did not match baseline (Testform.v1.0.2.pdf.pbmraw.72.1) for file: /home/regression/comparefiles/Testform.v1.0.2.pdf
======================================================================
FAIL: Checking Testform.v1.0.2.pdf (pbmraw/300dpi/noband) against baseline
----------------------------------------------------------------------
md5sum did not match baseline (Testform.v1.0.2.pdf.pbmraw.300.0) for file: /home/regression/comparefiles/Testform.v1.0.2.pdf
======================================================================
FAIL: Checking Testform.v1.0.2.pdf (pbmraw/300dpi/banded) against baseline
----------------------------------------------------------------------
md5sum did not match baseline (Testform.v1.0.2.pdf.pbmraw.300.1) for file: /home/regression/comparefiles/Testform.v1.0.2.pdf
======================================================================
FAIL: Checking Testform.v1.0.2.pdf (pgmraw/72dpi/noband) against baseline
----------------------------------------------------------------------
md5sum did not match baseline (Testform.v1.0.2.pdf.pgmraw.72.0) for file: /home/regression/comparefiles/Testform.v1.0.2.pdf
======================================================================
FAIL: Checking Testform.v1.0.2.pdf (pgmraw/72dpi/banded) against baseline
----------------------------------------------------------------------
md5sum did not match baseline (Testform.v1.0.2.pdf.pgmraw.72.1) for file: /home/regression/comparefiles/Testform.v1.0.2.pdf
======================================================================
FAIL: Checking Testform.v1.0.2.pdf (pgmraw/300dpi/noband) against baseline
----------------------------------------------------------------------
md5sum did not match baseline (Testform.v1.0.2.pdf.pgmraw.300.0) for file: /home/regression/comparefiles/Testform.v1.0.2.pdf
======================================================================
FAIL: Checking Testform.v1.0.2.pdf (pgmraw/300dpi/banded) against baseline
----------------------------------------------------------------------
md5sum did not match baseline (Testform.v1.0.2.pdf.pgmraw.300.1) for file: /home/regression/comparefiles/Testform.v1.0.2.pdf
======================================================================
FAIL: Checking Testform.v1.0.2.pdf (ppmraw/72dpi/noband) against baseline
----------------------------------------------------------------------
md5sum did not match baseline (Testform.v1.0.2.pdf.ppmraw.72.0) for file: /home/regression/comparefiles/Testform.v1.0.2.pdf
======================================================================
FAIL: Checking Testform.v1.0.2.pdf (ppmraw/72dpi/banded) against baseline
----------------------------------------------------------------------
md5sum did not match baseline (Testform.v1.0.2.pdf.ppmraw.72.1) for file: /home/regression/comparefiles/Testform.v1.0.2.pdf
======================================================================
FAIL: Checking Testform.v1.0.2.pdf (ppmraw/300dpi/noband) against baseline
----------------------------------------------------------------------
md5sum did not match baseline (Testform.v1.0.2.pdf.ppmraw.300.0) for file: /home/regression/comparefiles/Testform.v1.0.2.pdf
======================================================================
FAIL: Checking Testform.v1.0.2.pdf (ppmraw/300dpi/banded) against baseline
----------------------------------------------------------------------
md5sum did not match baseline (Testform.v1.0.2.pdf.ppmraw.300.1) for file: /home/regression/comparefiles/Testform.v1.0.2.pdf
======================================================================
FAIL: Checking Testform.v1.0.2.pdf (pkmraw/72dpi/noband) against baseline
----------------------------------------------------------------------
md5sum did not match baseline (Testform.v1.0.2.pdf.pkmraw.72.0) for file: /home/regression/comparefiles/Testform.v1.0.2.pdf
======================================================================
FAIL: Checking Testform.v1.0.2.pdf (pkmraw/72dpi/banded) against baseline
----------------------------------------------------------------------
md5sum did not match baseline (Testform.v1.0.2.pdf.pkmraw.72.1) for file: /home/regression/comparefiles/Testform.v1.0.2.pdf
======================================================================
FAIL: Checking Testform.v1.0.2.pdf (pkmraw/300dpi/noband) against baseline
----------------------------------------------------------------------
md5sum did not match baseline (Testform.v1.0.2.pdf.pkmraw.300.0) for file: /home/regression/comparefiles/Testform.v1.0.2.pdf
======================================================================
FAIL: Checking Testform.v1.0.2.pdf (pkmraw/300dpi/banded) against baseline
----------------------------------------------------------------------
md5sum did not match baseline (Testform.v1.0.2.pdf.pkmraw.300.1) for file: /home/regression/comparefiles/Testform.v1.0.2.pdf
======================================================================
FAIL: Checking Es001-01.pdf (pbmraw/72dpi/noband) against baseline
----------------------------------------------------------------------
md5sum did not match baseline (Es001-01.pdf.pbmraw.72.0) for file: /home/regression/comparefiles/Es001-01.pdf
======================================================================
FAIL: Checking Es001-01.pdf (pbmraw/72dpi/banded) against baseline
----------------------------------------------------------------------
md5sum did not match baseline (Es001-01.pdf.pbmraw.72.1) for file: /home/regression/comparefiles/Es001-01.pdf
======================================================================
FAIL: Checking Es001-01.pdf (pbmraw/300dpi/noband) against baseline
----------------------------------------------------------------------
md5sum did not match baseline (Es001-01.pdf.pbmraw.300.0) for file: /home/regression/comparefiles/Es001-01.pdf
======================================================================
FAIL: Checking Es001-01.pdf (pbmraw/300dpi/banded) against baseline
----------------------------------------------------------------------
md5sum did not match baseline (Es001-01.pdf.pbmraw.300.1) for file: /home/regression/comparefiles/Es001-01.pdf
======================================================================
FAIL: Checking Es001-01.pdf (pgmraw/72dpi/noband) against baseline
----------------------------------------------------------------------
md5sum did not match baseline (Es001-01.pdf.pgmraw.72.0) for file: /home/regression/comparefiles/Es001-01.pdf
======================================================================
FAIL: Checking Es001-01.pdf (pgmraw/72dpi/banded) against baseline
----------------------------------------------------------------------
md5sum did not match baseline (Es001-01.pdf.pgmraw.72.1) for file: /home/regression/comparefiles/Es001-01.pdf
======================================================================
FAIL: Checking Es001-01.pdf (pgmraw/300dpi/noband) against baseline
----------------------------------------------------------------------
md5sum did not match baseline (Es001-01.pdf.pgmraw.300.0) for file: /home/regression/comparefiles/Es001-01.pdf
======================================================================
FAIL: Checking Es001-01.pdf (pgmraw/300dpi/banded) against baseline
----------------------------------------------------------------------
md5sum did not match baseline (Es001-01.pdf.pgmraw.300.1) for file: /home/regression/comparefiles/Es001-01.pdf
======================================================================
FAIL: Checking Es001-01.pdf (ppmraw/72dpi/noband) against baseline
----------------------------------------------------------------------
md5sum did not match baseline (Es001-01.pdf.ppmraw.72.0) for file: /home/regression/comparefiles/Es001-01.pdf
======================================================================
FAIL: Checking Es001-01.pdf (ppmraw/72dpi/banded) against baseline
----------------------------------------------------------------------
md5sum did not match baseline (Es001-01.pdf.ppmraw.72.1) for file: /home/regression/comparefiles/Es001-01.pdf
======================================================================
FAIL: Checking Es001-01.pdf (ppmraw/300dpi/noband) against baseline
----------------------------------------------------------------------
md5sum did not match baseline (Es001-01.pdf.ppmraw.300.0) for file: /home/regression/comparefiles/Es001-01.pdf
======================================================================
FAIL: Checking Es001-01.pdf (ppmraw/300dpi/banded) against baseline
----------------------------------------------------------------------
md5sum did not match baseline (Es001-01.pdf.ppmraw.300.1) for file: /home/regression/comparefiles/Es001-01.pdf
======================================================================
FAIL: Checking Es001-01.pdf (pkmraw/72dpi/noband) against baseline
----------------------------------------------------------------------
md5sum did not match baseline (Es001-01.pdf.pkmraw.72.0) for file: /home/regression/comparefiles/Es001-01.pdf
======================================================================
FAIL: Checking Es001-01.pdf (pkmraw/72dpi/banded) against baseline
----------------------------------------------------------------------
md5sum did not match baseline (Es001-01.pdf.pkmraw.72.1) for file: /home/regression/comparefiles/Es001-01.pdf
======================================================================
FAIL: Checking Es001-01.pdf (pkmraw/300dpi/noband) against baseline
----------------------------------------------------------------------
md5sum did not match baseline (Es001-01.pdf.pkmraw.300.0) for file: /home/regression/comparefiles/Es001-01.pdf
======================================================================
FAIL: Checking Es001-01.pdf (pkmraw/300dpi/banded) against baseline
----------------------------------------------------------------------
md5sum did not match baseline (Es001-01.pdf.pkmraw.300.1) for file: /home/regression/comparefiles/Es001-01.pdf
======================================================================
FAIL: Checking annots.pdf (pbmraw/72dpi/banded) against baseline
----------------------------------------------------------------------
md5sum did not match baseline (annots.pdf.pbmraw.72.1) for file: /home/regression/comparefiles/annots.pdf
======================================================================
FAIL: Checking annots.pdf (pgmraw/72dpi/banded) against baseline
----------------------------------------------------------------------
md5sum did not match baseline (annots.pdf.pgmraw.72.1) for file: /home/regression/comparefiles/annots.pdf
======================================================================
FAIL: Checking annots.pdf (ppmraw/72dpi/banded) against baseline
----------------------------------------------------------------------
md5sum did not match baseline (annots.pdf.ppmraw.72.1) for file: /home/regression/comparefiles/annots.pdf
======================================================================
FAIL: Checking annots.pdf (pkmraw/72dpi/banded) against baseline
----------------------------------------------------------------------
md5sum did not match baseline (annots.pdf.pkmraw.72.1) for file: /home/regression/comparefiles/annots.pdf
======================================================================
FAIL: Checking pdfwrite of 0.pdf (ppmraw/72dpi/noband) against baseline
----------------------------------------------------------------------
md5sum did not match baseline (0.pdf.pdf.ppmraw.72.0) for file: /home/regression/comparefiles/0.pdf
======================================================================
FAIL: Checking pdfwrite of 0.pdf (ppmraw/300dpi/noband) against baseline
----------------------------------------------------------------------
md5sum did not match baseline (0.pdf.pdf.ppmraw.300.0) for file: /home/regression/comparefiles/0.pdf
======================================================================
FAIL: Checking pdfwrite of 0.pdf (pkmraw/300dpi/noband) against baseline
----------------------------------------------------------------------
md5sum did not match baseline (0.pdf.pdf.pkmraw.300.0) for file: /home/regression/comparefiles/0.pdf
======================================================================
FAIL: Checking pdfwrite of 000040cf.000_60.pdf (ppmraw/72dpi/noband) against baseline
----------------------------------------------------------------------
md5sum did not match baseline (000040cf.000_60.pdf.pdf.ppmraw.72.0) for file: /home/regression/comparefiles/000040cf.000_60.pdf
======================================================================
FAIL: Checking pdfwrite of 000040cf.000_60.pdf (ppmraw/300dpi/noband) against baseline
----------------------------------------------------------------------
md5sum did not match baseline (000040cf.000_60.pdf.pdf.ppmraw.300.0) for file: /home/regression/comparefiles/000040cf.000_60.pdf
======================================================================
FAIL: Checking pdfwrite of 000040cf.000_60.pdf (pkmraw/300dpi/noband) against baseline
----------------------------------------------------------------------
md5sum did not match baseline (000040cf.000_60.pdf.pdf.pkmraw.300.0) for file: /home/regression/comparefiles/000040cf.000_60.pdf
======================================================================
FAIL: Checking pdfwrite of 321-05.ps (ppmraw/300dpi/noband) against baseline
----------------------------------------------------------------------
md5sum did not match baseline (321-05.ps.pdf.ppmraw.300.0) for file: /home/regression/comparefiles/321-05.ps
======================================================================
FAIL: Checking pdfwrite of 321-05.ps (pkmraw/300dpi/noband) against baseline
----------------------------------------------------------------------
md5sum did not match baseline (321-05.ps.pdf.pkmraw.300.0) for file: /home/regression/comparefiles/321-05.ps
======================================================================
FAIL: Checking pdfwrite of 455690.pdf (ppmraw/72dpi/noband) against baseline
----------------------------------------------------------------------
md5sum did not match baseline (455690.pdf.pdf.ppmraw.72.0) for file: /home/regression/comparefiles/455690.pdf
======================================================================
FAIL: Checking pdfwrite of 86554321.pdf (ppmraw/72dpi/noband) against baseline
----------------------------------------------------------------------
md5sum did not match baseline (86554321.pdf.pdf.ppmraw.72.0) for file: /home/regression/comparefiles/86554321.pdf
======================================================================
FAIL: Checking pdfwrite of 86554321.pdf (ppmraw/300dpi/noband) against baseline
----------------------------------------------------------------------
md5sum did not match baseline (86554321.pdf.pdf.ppmraw.300.0) for file: /home/regression/comparefiles/86554321.pdf
======================================================================
FAIL: Checking pdfwrite of 86554321.pdf (pkmraw/300dpi/noband) against baseline
----------------------------------------------------------------------
md5sum did not match baseline (86554321.pdf.pdf.pkmraw.300.0) for file: /home/regression/comparefiles/86554321.pdf
======================================================================
FAIL: Checking pdfwrite of ADOBE1-4.pdf (ppmraw/72dpi/noband) against baseline
----------------------------------------------------------------------
md5sum did not match baseline (ADOBE1-4.pdf.pdf.ppmraw.72.0) for file: /home/regression/comparefiles/ADOBE1-4.pdf
======================================================================
FAIL: Checking pdfwrite of ADOBE1-4.pdf (ppmraw/300dpi/noband) against baseline
----------------------------------------------------------------------
md5sum did not match baseline (ADOBE1-4.pdf.pdf.ppmraw.300.0) for file: /home/regression/comparefiles/ADOBE1-4.pdf
======================================================================
FAIL: Checking pdfwrite of ADOBE1-4.pdf (pkmraw/300dpi/noband) against baseline
----------------------------------------------------------------------
md5sum did not match baseline (ADOBE1-4.pdf.pdf.pkmraw.300.0) for file: /home/regression/comparefiles/ADOBE1-4.pdf
======================================================================
FAIL: Checking pdfwrite of Fixed_Original.pdf (ppmraw/300dpi/noband) against baseline
----------------------------------------------------------------------
md5sum did not match baseline (Fixed_Original.pdf.pdf.ppmraw.300.0) for file: /home/regression/comparefiles/Fixed_Original.pdf
======================================================================
FAIL: Checking pdfwrite of H00216q.pdf (ppmraw/72dpi/noband) against baseline
----------------------------------------------------------------------
md5sum did not match baseline (H00216q.pdf.pdf.ppmraw.72.0) for file: /home/regression/comparefiles/H00216q.pdf
======================================================================
FAIL: Checking pdfwrite of H00216q.pdf (ppmraw/300dpi/noband) against baseline
----------------------------------------------------------------------
md5sum did not match baseline (H00216q.pdf.pdf.ppmraw.300.0) for file: /home/regression/comparefiles/H00216q.pdf
======================================================================
FAIL: Checking pdfwrite of H00216q.pdf (pkmraw/300dpi/noband) against baseline
----------------------------------------------------------------------
md5sum did not match baseline (H00216q.pdf.pdf.pkmraw.300.0) for file: /home/regression/comparefiles/H00216q.pdf
======================================================================
FAIL: Checking pdfwrite of Jahr2000.pdf (ppmraw/72dpi/noband) against baseline
----------------------------------------------------------------------
md5sum did not match baseline (Jahr2000.pdf.pdf.ppmraw.72.0) for file: /home/regression/comparefiles/Jahr2000.pdf
======================================================================
FAIL: Checking pdfwrite of Jahr2000.pdf (ppmraw/300dpi/noband) against baseline
----------------------------------------------------------------------
md5sum did not match baseline (Jahr2000.pdf.pdf.ppmraw.300.0) for file: /home/regression/comparefiles/Jahr2000.pdf
======================================================================
FAIL: Checking pdfwrite of Jahr2000.pdf (pkmraw/300dpi/noband) against baseline
----------------------------------------------------------------------
md5sum did not match baseline (Jahr2000.pdf.pdf.pkmraw.300.0) for file: /home/regression/comparefiles/Jahr2000.pdf
======================================================================
FAIL: Checking pdfwrite of LD.pdf (ppmraw/72dpi/noband) against baseline
----------------------------------------------------------------------
md5sum did not match baseline (LD.pdf.pdf.ppmraw.72.0) for file: /home/regression/comparefiles/LD.pdf
======================================================================
FAIL: Checking pdfwrite of LD.pdf (ppmraw/300dpi/noband) against baseline
----------------------------------------------------------------------
md5sum did not match baseline (LD.pdf.pdf.ppmraw.300.0) for file: /home/regression/comparefiles/LD.pdf
======================================================================
FAIL: Checking pdfwrite of LD.pdf (pkmraw/300dpi/noband) against baseline
----------------------------------------------------------------------
md5sum did not match baseline (LD.pdf.pdf.pkmraw.300.0) for file: /home/regression/comparefiles/LD.pdf
======================================================================
FAIL: Checking pdfwrite of NECPNTD.pdf (ppmraw/72dpi/noband) against baseline
----------------------------------------------------------------------
md5sum did not match baseline (NECPNTD.pdf.pdf.ppmraw.72.0) for file: /home/regression/comparefiles/NECPNTD.pdf
======================================================================
FAIL: Checking pdfwrite of NECPNTD.pdf (ppmraw/300dpi/noband) against baseline
----------------------------------------------------------------------
md5sum did not match baseline (NECPNTD.pdf.pdf.ppmraw.300.0) for file: /home/regression/comparefiles/NECPNTD.pdf
======================================================================
FAIL: Checking pdfwrite of NECPNTD.pdf (pkmraw/300dpi/noband) against baseline
----------------------------------------------------------------------
md5sum did not match baseline (NECPNTD.pdf.pdf.pkmraw.300.0) for file: /home/regression/comparefiles/NECPNTD.pdf
======================================================================
FAIL: Checking pdfwrite of QA_Inv.pdf (ppmraw/72dpi/noband) against baseline
----------------------------------------------------------------------
md5sum did not match baseline (QA_Inv.pdf.pdf.ppmraw.72.0) for file: /home/regression/comparefiles/QA_Inv.pdf
======================================================================
FAIL: Checking pdfwrite of QA_Inv.pdf (ppmraw/300dpi/noband) against baseline
----------------------------------------------------------------------
md5sum did not match baseline (QA_Inv.pdf.pdf.ppmraw.300.0) for file: /home/regression/comparefiles/QA_Inv.pdf
======================================================================
FAIL: Checking pdfwrite of QA_Inv.pdf (pkmraw/300dpi/noband) against baseline
----------------------------------------------------------------------
md5sum did not match baseline (QA_Inv.pdf.pdf.pkmraw.300.0) for file: /home/regression/comparefiles/QA_Inv.pdf
======================================================================
FAIL: Checking pdfwrite of RealCities.pdf (ppmraw/72dpi/noband) against baseline
----------------------------------------------------------------------
md5sum did not match baseline (RealCities.pdf.pdf.ppmraw.72.0) for file: /home/regression/comparefiles/RealCities.pdf
======================================================================
FAIL: Checking pdfwrite of RealCities.pdf (ppmraw/300dpi/noband) against baseline
----------------------------------------------------------------------
md5sum did not match baseline (RealCities.pdf.pdf.ppmraw.300.0) for file: /home/regression/comparefiles/RealCities.pdf
======================================================================
FAIL: Checking pdfwrite of RealCities.pdf (pkmraw/300dpi/noband) against baseline
----------------------------------------------------------------------
md5sum did not match baseline (RealCities.pdf.pdf.pkmraw.300.0) for file: /home/regression/comparefiles/RealCities.pdf
======================================================================
FAIL: Checking pdfwrite of aaon97_p7.pdf (ppmraw/72dpi/noband) against baseline
----------------------------------------------------------------------
md5sum did not match baseline (aaon97_p7.pdf.pdf.ppmraw.72.0) for file: /home/regression/comparefiles/aaon97_p7.pdf
======================================================================
FAIL: Checking pdfwrite of aaon97_p7.pdf (ppmraw/300dpi/noband) against baseline
----------------------------------------------------------------------
md5sum did not match baseline (aaon97_p7.pdf.pdf.ppmraw.300.0) for file: /home/regression/comparefiles/aaon97_p7.pdf
======================================================================
FAIL: Checking pdfwrite of aaon97_p7.pdf (pkmraw/300dpi/noband) against baseline
----------------------------------------------------------------------
md5sum did not match baseline (aaon97_p7.pdf.pdf.pkmraw.300.0) for file: /home/regression/comparefiles/aaon97_p7.pdf
======================================================================
FAIL: Checking pdfwrite of acrobat.pdf (ppmraw/72dpi/noband) against baseline
----------------------------------------------------------------------
md5sum did not match baseline (acrobat.pdf.pdf.ppmraw.72.0) for file: /home/regression/comparefiles/acrobat.pdf
======================================================================
FAIL: Checking pdfwrite of acrobat.pdf (ppmraw/300dpi/noband) against baseline
----------------------------------------------------------------------
md5sum did not match baseline (acrobat.pdf.pdf.ppmraw.300.0) for file: /home/regression/comparefiles/acrobat.pdf
======================================================================
FAIL: Checking pdfwrite of acrobat.pdf (pkmraw/300dpi/noband) against baseline
----------------------------------------------------------------------
md5sum did not match baseline (acrobat.pdf.pdf.pkmraw.300.0) for file: /home/regression/comparefiles/acrobat.pdf
======================================================================
FAIL: Checking pdfwrite of adesso1.pdf (ppmraw/72dpi/noband) against baseline
----------------------------------------------------------------------
md5sum did not match baseline (adesso1.pdf.pdf.ppmraw.72.0) for file: /home/regression/comparefiles/adesso1.pdf
======================================================================
FAIL: Checking pdfwrite of adesso1.pdf (ppmraw/300dpi/noband) against baseline
----------------------------------------------------------------------
md5sum did not match baseline (adesso1.pdf.pdf.ppmraw.300.0) for file: /home/regression/comparefiles/adesso1.pdf
======================================================================
FAIL: Checking pdfwrite of adesso1.pdf (pkmraw/300dpi/noband) against baseline
----------------------------------------------------------------------
md5sum did not match baseline (adesso1.pdf.pdf.pkmraw.300.0) for file: /home/regression/comparefiles/adesso1.pdf
======================================================================
FAIL: Checking pdfwrite of adesso3.pdf (ppmraw/72dpi/noband) against baseline
----------------------------------------------------------------------
md5sum did not match baseline (adesso3.pdf.pdf.ppmraw.72.0) for file: /home/regression/comparefiles/adesso3.pdf
======================================================================
FAIL: Checking pdfwrite of adesso3.pdf (ppmraw/300dpi/noband) against baseline
----------------------------------------------------------------------
md5sum did not match baseline (adesso3.pdf.pdf.ppmraw.300.0) for file: /home/regression/comparefiles/adesso3.pdf
======================================================================
FAIL: Checking pdfwrite of adesso3.pdf (pkmraw/300dpi/noband) against baseline
----------------------------------------------------------------------
md5sum did not match baseline (adesso3.pdf.pdf.pkmraw.300.0) for file: /home/regression/comparefiles/adesso3.pdf
======================================================================
FAIL: Checking pdfwrite of adesso5.pdf (ppmraw/72dpi/noband) against baseline
----------------------------------------------------------------------
md5sum did not match baseline (adesso5.pdf.pdf.ppmraw.72.0) for file: /home/regression/comparefiles/adesso5.pdf
======================================================================
FAIL: Checking pdfwrite of adesso5.pdf (ppmraw/300dpi/noband) against baseline
----------------------------------------------------------------------
md5sum did not match baseline (adesso5.pdf.pdf.ppmraw.300.0) for file: /home/regression/comparefiles/adesso5.pdf
======================================================================
FAIL: Checking pdfwrite of adesso5.pdf (pkmraw/300dpi/noband) against baseline
----------------------------------------------------------------------
md5sum did not match baseline (adesso5.pdf.pdf.pkmraw.300.0) for file: /home/regression/comparefiles/adesso5.pdf
======================================================================
FAIL: Checking pdfwrite of adesso6.pdf (ppmraw/72dpi/noband) against baseline
----------------------------------------------------------------------
md5sum did not match baseline (adesso6.pdf.pdf.ppmraw.72.0) for file: /home/regression/comparefiles/adesso6.pdf
======================================================================
FAIL: Checking pdfwrite of adesso6.pdf (ppmraw/300dpi/noband) against baseline
----------------------------------------------------------------------
md5sum did not match baseline (adesso6.pdf.pdf.ppmraw.300.0) for file: /home/regression/comparefiles/adesso6.pdf
======================================================================
FAIL: Checking pdfwrite of adesso6.pdf (pkmraw/300dpi/noband) against baseline
----------------------------------------------------------------------
md5sum did not match baseline (adesso6.pdf.pdf.pkmraw.300.0) for file: /home/regression/comparefiles/adesso6.pdf
======================================================================
FAIL: Checking pdfwrite of adesso7.pdf (ppmraw/72dpi/noband) against baseline
----------------------------------------------------------------------
md5sum did not match baseline (adesso7.pdf.pdf.ppmraw.72.0) for file: /home/regression/comparefiles/adesso7.pdf
======================================================================
FAIL: Checking pdfwrite of adesso7.pdf (ppmraw/300dpi/noband) against baseline
----------------------------------------------------------------------
md5sum did not match baseline (adesso7.pdf.pdf.ppmraw.300.0) for file: /home/regression/comparefiles/adesso7.pdf
======================================================================
FAIL: Checking pdfwrite of adesso7.pdf (pkmraw/300dpi/noband) against baseline
----------------------------------------------------------------------
md5sum did not match baseline (adesso7.pdf.pdf.pkmraw.300.0) for file: /home/regression/comparefiles/adesso7.pdf
======================================================================
FAIL: Checking pdfwrite of brochurep1.pdf (ppmraw/72dpi/noband) against baseline
----------------------------------------------------------------------
md5sum did not match baseline (brochurep1.pdf.pdf.ppmraw.72.0) for file: /home/regression/comparefiles/brochurep1.pdf
======================================================================
FAIL: Checking pdfwrite of brochurep1.pdf (ppmraw/300dpi/noband) against baseline
----------------------------------------------------------------------
md5sum did not match baseline (brochurep1.pdf.pdf.ppmraw.300.0) for file: /home/regression/comparefiles/brochurep1.pdf
======================================================================
FAIL: Checking pdfwrite of brochurep1.pdf (pkmraw/300dpi/noband) against baseline
----------------------------------------------------------------------
md5sum did not match baseline (brochurep1.pdf.pdf.pkmraw.300.0) for file: /home/regression/comparefiles/brochurep1.pdf
======================================================================
FAIL: Checking pdfwrite of ccc.pdf (ppmraw/72dpi/noband) against baseline
----------------------------------------------------------------------
md5sum did not match baseline (ccc.pdf.pdf.ppmraw.72.0) for file: /home/regression/comparefiles/ccc.pdf
======================================================================
FAIL: Checking pdfwrite of ccc.pdf (ppmraw/300dpi/noband) against baseline
----------------------------------------------------------------------
md5sum did not match baseline (ccc.pdf.pdf.ppmraw.300.0) for file: /home/regression/comparefiles/ccc.pdf
======================================================================
FAIL: Checking pdfwrite of ccc.pdf (pkmraw/300dpi/noband) against baseline
----------------------------------------------------------------------
md5sum did not match baseline (ccc.pdf.pdf.pkmraw.300.0) for file: /home/regression/comparefiles/ccc.pdf
======================================================================
FAIL: Checking pdfwrite of chstudy.pdf (ppmraw/72dpi/noband) against baseline
----------------------------------------------------------------------
md5sum did not match baseline (chstudy.pdf.pdf.ppmraw.72.0) for file: /home/regression/comparefiles/chstudy.pdf
======================================================================
FAIL: Checking pdfwrite of chstudy.pdf (ppmraw/300dpi/noband) against baseline
----------------------------------------------------------------------
md5sum did not match baseline (chstudy.pdf.pdf.ppmraw.300.0) for file: /home/regression/comparefiles/chstudy.pdf
======================================================================
FAIL: Checking pdfwrite of chstudy.pdf (pkmraw/300dpi/noband) against baseline
----------------------------------------------------------------------
md5sum did not match baseline (chstudy.pdf.pdf.pkmraw.300.0) for file: /home/regression/comparefiles/chstudy.pdf
======================================================================
FAIL: Checking pdfwrite of gs.anotherfailure.pdf (ppmraw/72dpi/noband) against baseline
----------------------------------------------------------------------
md5sum did not match baseline (gs.anotherfailure.pdf.pdf.ppmraw.72.0) for file: /home/regression/comparefiles/gs.anotherfailure.pdf
======================================================================
FAIL: Checking pdfwrite of gs.anotherfailure.pdf (ppmraw/300dpi/noband) against baseline
----------------------------------------------------------------------
md5sum did not match baseline (gs.anotherfailure.pdf.pdf.ppmraw.300.0) for file: /home/regression/comparefiles/gs.anotherfailure.pdf
======================================================================
FAIL: Checking pdfwrite of gs.anotherfailure.pdf (pkmraw/300dpi/noband) against baseline
----------------------------------------------------------------------
md5sum did not match baseline (gs.anotherfailure.pdf.pdf.pkmraw.300.0) for file: /home/regression/comparefiles/gs.anotherfailure.pdf
======================================================================
FAIL: Checking pdfwrite of gs5.98-dragon.pdf (ppmraw/72dpi/noband) against baseline
----------------------------------------------------------------------
md5sum did not match baseline (gs5.98-dragon.pdf.pdf.ppmraw.72.0) for file: /home/regression/comparefiles/gs5.98-dragon.pdf
======================================================================
FAIL: Checking pdfwrite of gs5.98-dragon.pdf (ppmraw/300dpi/noband) against baseline
----------------------------------------------------------------------
md5sum did not match baseline (gs5.98-dragon.pdf.pdf.ppmraw.300.0) for file: /home/regression/comparefiles/gs5.98-dragon.pdf
======================================================================
FAIL: Checking pdfwrite of gs5.98-dragon.pdf (pkmraw/300dpi/noband) against baseline
----------------------------------------------------------------------
md5sum did not match baseline (gs5.98-dragon.pdf.pdf.pkmraw.300.0) for file: /home/regression/comparefiles/gs5.98-dragon.pdf
======================================================================
FAIL: Checking pdfwrite of js.pdf (ppmraw/72dpi/noband) against baseline
----------------------------------------------------------------------
md5sum did not match baseline (js.pdf.pdf.ppmraw.72.0) for file: /home/regression/comparefiles/js.pdf
======================================================================
FAIL: Checking pdfwrite of js.pdf (ppmraw/300dpi/noband) against baseline
----------------------------------------------------------------------
md5sum did not match baseline (js.pdf.pdf.ppmraw.300.0) for file: /home/regression/comparefiles/js.pdf
======================================================================
FAIL: Checking pdfwrite of js.pdf (pkmraw/300dpi/noband) against baseline
----------------------------------------------------------------------
md5sum did not match baseline (js.pdf.pdf.pkmraw.300.0) for file: /home/regression/comparefiles/js.pdf
======================================================================
FAIL: Checking pdfwrite of kazmir.pdf (ppmraw/72dpi/noband) against baseline
----------------------------------------------------------------------
md5sum did not match baseline (kazmir.pdf.pdf.ppmraw.72.0) for file: /home/regression/comparefiles/kazmir.pdf
======================================================================
FAIL: Checking pdfwrite of kazmir.pdf (ppmraw/300dpi/noband) against baseline
----------------------------------------------------------------------
md5sum did not match baseline (kazmir.pdf.pdf.ppmraw.300.0) for file: /home/regression/comparefiles/kazmir.pdf
======================================================================
FAIL: Checking pdfwrite of kazmir.pdf (pkmraw/300dpi/noband) against baseline
----------------------------------------------------------------------
md5sum did not match baseline (kazmir.pdf.pdf.pkmraw.300.0) for file: /home/regression/comparefiles/kazmir.pdf
======================================================================
FAIL: Checking pdfwrite of knight.pdf (ppmraw/300dpi/noband) against baseline
----------------------------------------------------------------------
md5sum did not match baseline (knight.pdf.pdf.ppmraw.300.0) for file: /home/regression/comparefiles/knight.pdf
======================================================================
FAIL: Checking pdfwrite of knight.pdf (pkmraw/300dpi/noband) against baseline
----------------------------------------------------------------------
md5sum did not match baseline (knight.pdf.pdf.pkmraw.300.0) for file: /home/regression/comparefiles/knight.pdf
======================================================================
FAIL: Checking pdfwrite of narrow_font.pdf (ppmraw/72dpi/noband) against baseline
----------------------------------------------------------------------
md5sum did not match baseline (narrow_font.pdf.pdf.ppmraw.72.0) for file: /home/regression/comparefiles/narrow_font.pdf
======================================================================
FAIL: Checking pdfwrite of narrow_font.pdf (ppmraw/300dpi/noband) against baseline
----------------------------------------------------------------------
md5sum did not match baseline (narrow_font.pdf.pdf.ppmraw.300.0) for file: /home/regression/comparefiles/narrow_font.pdf
======================================================================
FAIL: Checking pdfwrite of narrow_font.pdf (pkmraw/300dpi/noband) against baseline
----------------------------------------------------------------------
md5sum did not match baseline (narrow_font.pdf.pdf.pkmraw.300.0) for file: /home/regression/comparefiles/narrow_font.pdf
======================================================================
FAIL: Checking pdfwrite of pdftops.pdf (ppmraw/72dpi/noband) against baseline
----------------------------------------------------------------------
md5sum did not match baseline (pdftops.pdf.pdf.ppmraw.72.0) for file: /home/regression/comparefiles/pdftops.pdf
======================================================================
FAIL: Checking pdfwrite of pdftops.pdf (ppmraw/300dpi/noband) against baseline
----------------------------------------------------------------------
md5sum did not match baseline (pdftops.pdf.pdf.ppmraw.300.0) for file: /home/regression/comparefiles/pdftops.pdf
======================================================================
FAIL: Checking pdfwrite of pdftops.pdf (pkmraw/300dpi/noband) against baseline
----------------------------------------------------------------------
md5sum did not match baseline (pdftops.pdf.pdf.pkmraw.300.0) for file: /home/regression/comparefiles/pdftops.pdf
======================================================================
FAIL: Checking pdfwrite of prfmm.pdf (ppmraw/72dpi/noband) against baseline
----------------------------------------------------------------------
md5sum did not match baseline (prfmm.pdf.pdf.ppmraw.72.0) for file: /home/regression/comparefiles/prfmm.pdf
======================================================================
FAIL: Checking pdfwrite of prfmm.pdf (ppmraw/300dpi/noband) against baseline
----------------------------------------------------------------------
md5sum did not match baseline (prfmm.pdf.pdf.ppmraw.300.0) for file: /home/regression/comparefiles/prfmm.pdf
======================================================================
FAIL: Checking pdfwrite of prfmm.pdf (pkmraw/300dpi/noband) against baseline
----------------------------------------------------------------------
md5sum did not match baseline (prfmm.pdf.pdf.pkmraw.300.0) for file: /home/regression/comparefiles/prfmm.pdf
======================================================================
FAIL: Checking pdfwrite of rf1025.pdf (ppmraw/72dpi/noband) against baseline
----------------------------------------------------------------------
md5sum did not match baseline (rf1025.pdf.pdf.ppmraw.72.0) for file: /home/regression/comparefiles/rf1025.pdf
======================================================================
FAIL: Checking pdfwrite of rf1025.pdf (ppmraw/300dpi/noband) against baseline
----------------------------------------------------------------------
md5sum did not match baseline (rf1025.pdf.pdf.ppmraw.300.0) for file: /home/regression/comparefiles/rf1025.pdf
======================================================================
FAIL: Checking pdfwrite of rf1025.pdf (pkmraw/300dpi/noband) against baseline
----------------------------------------------------------------------
md5sum did not match baseline (rf1025.pdf.pdf.pkmraw.300.0) for file: /home/regression/comparefiles/rf1025.pdf
======================================================================
FAIL: Checking pdfwrite of smdf.90441.102.pdf (ppmraw/72dpi/noband) against baseline
----------------------------------------------------------------------
md5sum did not match baseline (smdf.90441.102.pdf.pdf.ppmraw.72.0) for file: /home/regression/comparefiles/smdf.90441.102.pdf
======================================================================
FAIL: Checking pdfwrite of smdf.90441.102.pdf (ppmraw/300dpi/noband) against baseline
----------------------------------------------------------------------
md5sum did not match baseline (smdf.90441.102.pdf.pdf.ppmraw.300.0) for file: /home/regression/comparefiles/smdf.90441.102.pdf
======================================================================
FAIL: Checking pdfwrite of smdf.90441.102.pdf (pkmraw/300dpi/noband) against baseline
----------------------------------------------------------------------
md5sum did not match baseline (smdf.90441.102.pdf.pdf.pkmraw.300.0) for file: /home/regression/comparefiles/smdf.90441.102.pdf
======================================================================
FAIL: Checking pdfwrite of test.pdf (ppmraw/72dpi/noband) against baseline
----------------------------------------------------------------------
md5sum did not match baseline (test.pdf.pdf.ppmraw.72.0) for file: /home/regression/comparefiles/test.pdf
======================================================================
FAIL: Checking pdfwrite of test.pdf (ppmraw/300dpi/noband) against baseline
----------------------------------------------------------------------
md5sum did not match baseline (test.pdf.pdf.ppmraw.300.0) for file: /home/regression/comparefiles/test.pdf
======================================================================
FAIL: Checking pdfwrite of test.pdf (pkmraw/300dpi/noband) against baseline
----------------------------------------------------------------------
md5sum did not match baseline (test.pdf.pdf.pkmraw.300.0) for file: /home/regression/comparefiles/test.pdf
======================================================================
FAIL: Checking pdfwrite of test2.pdf (ppmraw/72dpi/noband) against baseline
----------------------------------------------------------------------
md5sum did not match baseline (test2.pdf.pdf.ppmraw.72.0) for file: /home/regression/comparefiles/test2.pdf
======================================================================
FAIL: Checking pdfwrite of textsavematrix.pdf (ppmraw/72dpi/noband) against baseline
----------------------------------------------------------------------
md5sum did not match baseline (textsavematrix.pdf.pdf.ppmraw.72.0) for file: /home/regression/comparefiles/textsavematrix.pdf
======================================================================
FAIL: Checking pdfwrite of textsavematrix.pdf (ppmraw/300dpi/noband) against baseline
----------------------------------------------------------------------
md5sum did not match baseline (textsavematrix.pdf.pdf.ppmraw.300.0) for file: /home/regression/comparefiles/textsavematrix.pdf
======================================================================
FAIL: Checking pdfwrite of textsavematrix.pdf (pkmraw/300dpi/noband) against baseline
----------------------------------------------------------------------
md5sum did not match baseline (textsavematrix.pdf.pdf.pkmraw.300.0) for file: /home/regression/comparefiles/textsavematrix.pdf
======================================================================
FAIL: Checking pdfwrite of a.pdf (ppmraw/72dpi/noband) against baseline
----------------------------------------------------------------------
md5sum did not match baseline (a.pdf.pdf.ppmraw.72.0) for file: /home/regression/comparefiles/a.pdf
======================================================================
FAIL: Checking pdfwrite of a.pdf (ppmraw/300dpi/noband) against baseline
----------------------------------------------------------------------
md5sum did not match baseline (a.pdf.pdf.ppmraw.300.0) for file: /home/regression/comparefiles/a.pdf
======================================================================
FAIL: Checking pdfwrite of a.pdf (pkmraw/300dpi/noband) against baseline
----------------------------------------------------------------------
md5sum did not match baseline (a.pdf.pdf.pkmraw.300.0) for file: /home/regression/comparefiles/a.pdf
======================================================================
FAIL: Checking pdfwrite of CAT_LOGO.ps (ppmraw/72dpi/noband) against baseline
----------------------------------------------------------------------
md5sum did not match baseline (CAT_LOGO.ps.pdf.ppmraw.72.0) for file: /home/regression/comparefiles/CAT_LOGO.ps
======================================================================
FAIL: Checking pdfwrite of CAT_LOGO.ps (ppmraw/300dpi/noband) against baseline
----------------------------------------------------------------------
md5sum did not match baseline (CAT_LOGO.ps.pdf.ppmraw.300.0) for file: /home/regression/comparefiles/CAT_LOGO.ps
======================================================================
FAIL: Checking pdfwrite of CAT_LOGO.ps (pkmraw/300dpi/noband) against baseline
----------------------------------------------------------------------
md5sum did not match baseline (CAT_LOGO.ps.pdf.pkmraw.300.0) for file: /home/regression/comparefiles/CAT_LOGO.ps
======================================================================
FAIL: Checking pdfwrite of Es001-01.pdf (ppmraw/72dpi/noband) against baseline
----------------------------------------------------------------------
md5sum did not match baseline (Es001-01.pdf.pdf.ppmraw.72.0) for file: /home/regression/comparefiles/Es001-01.pdf
======================================================================
FAIL: Checking pdfwrite of Es001-01.pdf (ppmraw/300dpi/noband) against baseline
----------------------------------------------------------------------
md5sum did not match baseline (Es001-01.pdf.pdf.ppmraw.300.0) for file: /home/regression/comparefiles/Es001-01.pdf
======================================================================
FAIL: Checking pdfwrite of Es001-01.pdf (pkmraw/300dpi/noband) against baseline
----------------------------------------------------------------------
md5sum did not match baseline (Es001-01.pdf.pdf.pkmraw.300.0) for file: /home/regression/comparefiles/Es001-01.pdf
======================================================================
FAIL: Checking pdfwrite of alphabet.ps (ppmraw/72dpi/noband) against baseline
----------------------------------------------------------------------
md5sum did not match baseline (alphabet.ps.pdf.ppmraw.72.0) for file: /home/regression/comparefiles/alphabet.ps
======================================================================
FAIL: Checking pdfwrite of doretree.ps (ppmraw/300dpi/noband) against baseline
----------------------------------------------------------------------
md5sum did not match baseline (doretree.ps.pdf.ppmraw.300.0) for file: /home/regression/comparefiles/doretree.ps
======================================================================
FAIL: Checking pdfwrite of doretree.ps (pkmraw/300dpi/noband) against baseline
----------------------------------------------------------------------
md5sum did not match baseline (doretree.ps.pdf.pkmraw.300.0) for file: /home/regression/comparefiles/doretree.ps
======================================================================
FAIL: Checking pdfwrite of waterfal.ps (ppmraw/72dpi/noband) against baseline
----------------------------------------------------------------------
md5sum did not match baseline (waterfal.ps.pdf.ppmraw.72.0) for file: /home/regression/comparefiles/waterfal.ps
======================================================================
FAIL: Checking pdfwrite of waterfal.ps (ppmraw/300dpi/noband) against baseline
----------------------------------------------------------------------
md5sum did not match baseline (waterfal.ps.pdf.ppmraw.300.0) for file: /home/regression/comparefiles/waterfal.ps
======================================================================
FAIL: Checking pdfwrite of waterfal.ps (pkmraw/300dpi/noband) against baseline
----------------------------------------------------------------------
md5sum did not match baseline (waterfal.ps.pdf.pkmraw.300.0) for file: /home/regression/comparefiles/waterfal.ps
----------------------------------------------------------------------
Ran 7274 tests in 9862.412s

FAILED (failures=203, errors=47)