[gs-regression] gs regression report - 2002-10-29

regression@casper.ghostscript.com regression@casper.ghostscript.com
Tue, 29 Oct 2002 05:46:06 -0800


The following regression changes happened since yesterday's report:


The complete list of regressions for today:
Checking Fixed_Original.pdf (pgmraw/300dpi/noband) against baseline ... DIFFER
Checking Fixed_Original.pdf (pgmraw/300dpi/banded) against baseline ... DIFFER
Checking Fixed_Original.pdf (ppmraw/300dpi/noband) against baseline ... DIFFER
Checking Fixed_Original.pdf (ppmraw/300dpi/banded) against baseline ... DIFFER
Checking Altona-Testsuite_p2_S_x3.pdf (pbmraw/72dpi/noband) against baseline ... DIFFER
Checking Altona-Testsuite_p2_S_x3.pdf (pbmraw/72dpi/banded) against baseline ... DIFFER
Checking Altona-Testsuite_p2_S_x3.pdf (pbmraw/300dpi/noband) against baseline ... DIFFER
Checking Altona-Testsuite_p2_S_x3.pdf (pbmraw/300dpi/banded) against baseline ... DIFFER
Checking Altona-Testsuite_p2_S_x3.pdf (pgmraw/72dpi/noband) against baseline ... DIFFER
Checking Altona-Testsuite_p2_S_x3.pdf (pgmraw/72dpi/banded) against baseline ... DIFFER
Checking Altona-Testsuite_p2_S_x3.pdf (pgmraw/300dpi/noband) against baseline ... DIFFER
Checking Altona-Testsuite_p2_S_x3.pdf (pgmraw/300dpi/banded) against baseline ... DIFFER
Checking Altona-Testsuite_p2_S_x3.pdf (ppmraw/72dpi/noband) against baseline ... DIFFER
Checking Altona-Testsuite_p2_S_x3.pdf (ppmraw/72dpi/banded) against baseline ... DIFFER
Checking Altona-Testsuite_p2_S_x3.pdf (ppmraw/300dpi/noband) against baseline ... DIFFER
Checking Altona-Testsuite_p2_S_x3.pdf (ppmraw/300dpi/banded) against baseline ... DIFFER
Checking Altona-Testsuite_p2_S_x3.pdf (pkmraw/72dpi/noband) against baseline ... DIFFER
Checking Altona-Testsuite_p2_S_x3.pdf (pkmraw/72dpi/banded) against baseline ... DIFFER
Checking Altona-Testsuite_p2_S_x3.pdf (pkmraw/300dpi/noband) against baseline ... DIFFER
Checking Altona-Testsuite_p2_S_x3.pdf (pkmraw/300dpi/banded) against baseline ... DIFFER
Checking Altona.Page_3.2002-09-27.pdf (pbmraw/72dpi/noband) against baseline ... DIFFER
Checking Altona.Page_3.2002-09-27.pdf (pbmraw/72dpi/banded) against baseline ... DIFFER
Checking Altona.Page_3.2002-09-27.pdf (pbmraw/300dpi/noband) against baseline ... DIFFER
Checking Altona.Page_3.2002-09-27.pdf (pbmraw/300dpi/banded) against baseline ... DIFFER
Checking Altona.Page_3.2002-09-27.pdf (pgmraw/72dpi/noband) against baseline ... DIFFER
Checking Altona.Page_3.2002-09-27.pdf (pgmraw/72dpi/banded) against baseline ... DIFFER
Checking Altona.Page_3.2002-09-27.pdf (pgmraw/300dpi/noband) against baseline ... DIFFER
Checking Altona.Page_3.2002-09-27.pdf (pgmraw/300dpi/banded) against baseline ... DIFFER
Checking Altona.Page_3.2002-09-27.pdf (ppmraw/72dpi/noband) against baseline ... DIFFER
Checking Altona.Page_3.2002-09-27.pdf (ppmraw/72dpi/banded) against baseline ... DIFFER
Checking Altona.Page_3.2002-09-27.pdf (ppmraw/300dpi/noband) against baseline ... DIFFER
Checking Altona.Page_3.2002-09-27.pdf (ppmraw/300dpi/banded) against baseline ... DIFFER
Checking Altona.Page_3.2002-09-27.pdf (pkmraw/72dpi/noband) against baseline ... DIFFER
Checking Altona.Page_3.2002-09-27.pdf (pkmraw/72dpi/banded) against baseline ... DIFFER
Checking Altona.Page_3.2002-09-27.pdf (pkmraw/300dpi/noband) against baseline ... DIFFER
Checking Altona.Page_3.2002-09-27.pdf (pkmraw/300dpi/banded) against baseline ... DIFFER
Checking S2_Digitalproof-Forum_circles.pdf (pbmraw/72dpi/noband) against baseline ... ERROR
Checking S2_Digitalproof-Forum_circles.pdf (pbmraw/72dpi/banded) against baseline ... ERROR
Checking S2_Digitalproof-Forum_circles.pdf (pbmraw/300dpi/noband) against baseline ... ERROR
Checking S2_Digitalproof-Forum_circles.pdf (pbmraw/300dpi/banded) against baseline ... ERROR
Checking S2_Digitalproof-Forum_circles.pdf (pgmraw/72dpi/noband) against baseline ... ERROR
Checking S2_Digitalproof-Forum_circles.pdf (pgmraw/72dpi/banded) against baseline ... ERROR
Checking S2_Digitalproof-Forum_circles.pdf (pgmraw/300dpi/noband) against baseline ... ERROR
Checking S2_Digitalproof-Forum_circles.pdf (pgmraw/300dpi/banded) against baseline ... ERROR
Checking S2_Digitalproof-Forum_circles.pdf (ppmraw/72dpi/noband) against baseline ... ERROR
Checking S2_Digitalproof-Forum_circles.pdf (ppmraw/72dpi/banded) against baseline ... ERROR
Checking S2_Digitalproof-Forum_circles.pdf (ppmraw/300dpi/noband) against baseline ... ERROR
Checking S2_Digitalproof-Forum_circles.pdf (ppmraw/300dpi/banded) against baseline ... ERROR
Checking S2_Digitalproof-Forum_circles.pdf (pkmraw/72dpi/noband) against baseline ... ERROR
Checking S2_Digitalproof-Forum_circles.pdf (pkmraw/72dpi/banded) against baseline ... ERROR
Checking S2_Digitalproof-Forum_circles.pdf (pkmraw/300dpi/noband) against baseline ... ERROR
Checking S2_Digitalproof-Forum_circles.pdf (pkmraw/300dpi/banded) against baseline ... ERROR
Checking S2_Digitalproof-Forum_x3k.pdf (pbmraw/72dpi/noband) against baseline ... DIFFER
Checking S2_Digitalproof-Forum_x3k.pdf (pbmraw/72dpi/banded) against baseline ... DIFFER
Checking S2_Digitalproof-Forum_x3k.pdf (pbmraw/300dpi/noband) against baseline ... DIFFER
Checking S2_Digitalproof-Forum_x3k.pdf (pbmraw/300dpi/banded) against baseline ... DIFFER
Checking S2_Digitalproof-Forum_x3k.pdf (pgmraw/72dpi/noband) against baseline ... DIFFER
Checking S2_Digitalproof-Forum_x3k.pdf (pgmraw/72dpi/banded) against baseline ... DIFFER
Checking S2_Digitalproof-Forum_x3k.pdf (pgmraw/300dpi/noband) against baseline ... DIFFER
Checking S2_Digitalproof-Forum_x3k.pdf (pgmraw/300dpi/banded) against baseline ... DIFFER
Checking S2_Digitalproof-Forum_x3k.pdf (ppmraw/72dpi/noband) against baseline ... DIFFER
Checking S2_Digitalproof-Forum_x3k.pdf (ppmraw/72dpi/banded) against baseline ... DIFFER
Checking S2_Digitalproof-Forum_x3k.pdf (ppmraw/300dpi/noband) against baseline ... DIFFER
Checking S2_Digitalproof-Forum_x3k.pdf (ppmraw/300dpi/banded) against baseline ... DIFFER
Checking S2_Digitalproof-Forum_x3k.pdf (pkmraw/72dpi/noband) against baseline ... DIFFER
Checking S2_Digitalproof-Forum_x3k.pdf (pkmraw/72dpi/banded) against baseline ... DIFFER
Checking S2_Digitalproof-Forum_x3k.pdf (pkmraw/300dpi/noband) against baseline ... DIFFER
Checking S2_Digitalproof-Forum_x3k.pdf (pkmraw/300dpi/banded) against baseline ... DIFFER
Checking Testform.v1.0.2.pdf (pbmraw/72dpi/noband) against baseline ... DIFFER
Checking Testform.v1.0.2.pdf (pbmraw/72dpi/banded) against baseline ... DIFFER
Checking Testform.v1.0.2.pdf (pbmraw/300dpi/noband) against baseline ... DIFFER
Checking Testform.v1.0.2.pdf (pbmraw/300dpi/banded) against baseline ... DIFFER
Checking Testform.v1.0.2.pdf (pgmraw/72dpi/noband) against baseline ... DIFFER
Checking Testform.v1.0.2.pdf (pgmraw/72dpi/banded) against baseline ... DIFFER
Checking Testform.v1.0.2.pdf (pgmraw/300dpi/noband) against baseline ... DIFFER
Checking Testform.v1.0.2.pdf (pgmraw/300dpi/banded) against baseline ... DIFFER
Checking Testform.v1.0.2.pdf (ppmraw/72dpi/noband) against baseline ... DIFFER
Checking Testform.v1.0.2.pdf (ppmraw/72dpi/banded) against baseline ... DIFFER
Checking Testform.v1.0.2.pdf (ppmraw/300dpi/noband) against baseline ... DIFFER
Checking Testform.v1.0.2.pdf (ppmraw/300dpi/banded) against baseline ... DIFFER
Checking Testform.v1.0.2.pdf (pkmraw/72dpi/noband) against baseline ... DIFFER
Checking Testform.v1.0.2.pdf (pkmraw/72dpi/banded) against baseline ... DIFFER
Checking Testform.v1.0.2.pdf (pkmraw/300dpi/noband) against baseline ... DIFFER
Checking Testform.v1.0.2.pdf (pkmraw/300dpi/banded) against baseline ... DIFFER
Checking Es001-01.pdf (pbmraw/72dpi/noband) against baseline ... DIFFER
Checking Es001-01.pdf (pbmraw/72dpi/banded) against baseline ... DIFFER
Checking Es001-01.pdf (pbmraw/300dpi/noband) against baseline ... DIFFER
Checking Es001-01.pdf (pbmraw/300dpi/banded) against baseline ... DIFFER
Checking Es001-01.pdf (pgmraw/72dpi/noband) against baseline ... DIFFER
Checking Es001-01.pdf (pgmraw/72dpi/banded) against baseline ... DIFFER
Checking Es001-01.pdf (pgmraw/300dpi/noband) against baseline ... DIFFER
Checking Es001-01.pdf (pgmraw/300dpi/banded) against baseline ... DIFFER
Checking Es001-01.pdf (ppmraw/72dpi/noband) against baseline ... DIFFER
Checking Es001-01.pdf (ppmraw/72dpi/banded) against baseline ... DIFFER
Checking Es001-01.pdf (ppmraw/300dpi/noband) against baseline ... DIFFER
Checking Es001-01.pdf (ppmraw/300dpi/banded) against baseline ... DIFFER
Checking Es001-01.pdf (pkmraw/72dpi/noband) against baseline ... DIFFER
Checking Es001-01.pdf (pkmraw/72dpi/banded) against baseline ... DIFFER
Checking Es001-01.pdf (pkmraw/300dpi/noband) against baseline ... DIFFER
Checking Es001-01.pdf (pkmraw/300dpi/banded) against baseline ... DIFFER
Checking annots.pdf (pbmraw/72dpi/banded) against baseline ... DIFFER
Checking annots.pdf (pgmraw/72dpi/banded) against baseline ... DIFFER
Checking annots.pdf (ppmraw/72dpi/banded) against baseline ... DIFFER
Checking annots.pdf (pkmraw/72dpi/banded) against baseline ... DIFFER
Checking ridt91.eps (pbmraw/72dpi/noband) against baseline ... ERROR
Checking ridt91.eps (pbmraw/72dpi/banded) against baseline ... ERROR
Checking ridt91.eps (pbmraw/300dpi/noband) against baseline ... ERROR
Checking ridt91.eps (pbmraw/300dpi/banded) against baseline ... ERROR
Checking ridt91.eps (pgmraw/72dpi/noband) against baseline ... ERROR
Checking ridt91.eps (pgmraw/72dpi/banded) against baseline ... ERROR
Checking ridt91.eps (pgmraw/300dpi/noband) against baseline ... ERROR
Checking ridt91.eps (pgmraw/300dpi/banded) against baseline ... ERROR
Checking ridt91.eps (ppmraw/72dpi/noband) against baseline ... ERROR
Checking ridt91.eps (ppmraw/72dpi/banded) against baseline ... ERROR
Checking ridt91.eps (ppmraw/300dpi/noband) against baseline ... ERROR
Checking ridt91.eps (ppmraw/300dpi/banded) against baseline ... ERROR
Checking ridt91.eps (pkmraw/72dpi/noband) against baseline ... ERROR
Checking ridt91.eps (pkmraw/72dpi/banded) against baseline ... ERROR
Checking ridt91.eps (pkmraw/300dpi/noband) against baseline ... ERROR
Checking ridt91.eps (pkmraw/300dpi/banded) against baseline ... ERROR
Checking pdfwrite of QA_Inv.pdf (ppmraw/72dpi/noband) against baseline ... DIFFER
Checking pdfwrite of QA_Inv.pdf (ppmraw/300dpi/noband) against baseline ... DIFFER
Checking pdfwrite of QA_Inv.pdf (pkmraw/300dpi/noband) against baseline ... DIFFER
Checking pdfwrite of ccc.pdf (ppmraw/72dpi/noband) against baseline ... DIFFER
Checking pdfwrite of ccc.pdf (ppmraw/300dpi/noband) against baseline ... DIFFER
Checking pdfwrite of ccc.pdf (pkmraw/300dpi/noband) against baseline ... DIFFER
Checking pdfwrite of gs5.98-dragon.pdf (ppmraw/72dpi/noband) against baseline ... DIFFER
Checking pdfwrite of gs5.98-dragon.pdf (ppmraw/300dpi/noband) against baseline ... DIFFER
Checking pdfwrite of gs5.98-dragon.pdf (pkmraw/300dpi/noband) against baseline ... DIFFER
Checking pdfwrite of CAT_LOGO.ps (ppmraw/72dpi/noband) against baseline ... DIFFER
Checking pdfwrite of CAT_LOGO.ps (ppmraw/300dpi/noband) against baseline ... DIFFER
Checking pdfwrite of CAT_LOGO.ps (pkmraw/300dpi/noband) against baseline ... DIFFER

======================================================================
ERROR: Checking S2_Digitalproof-Forum_circles.pdf (pbmraw/72dpi/noband) against baseline
----------------------------------------------------------------------
Traceback (most recent call last):
  File "/home/regression/regression/gstestgs.py", line 158, in runTest
    self.assertEqual(sum, gssum.get_sum(file), 'md5sum did not match baseline (' + file + ') for file: ' + self.file)
  File "/home/regression/regression/gssum.py", line 43, in get_sum
    sum = db[file]
KeyError: S2_Digitalproof-Forum_circles.pdf.pbmraw.72.0
======================================================================
ERROR: Checking S2_Digitalproof-Forum_circles.pdf (pbmraw/72dpi/banded) against baseline
----------------------------------------------------------------------
Traceback (most recent call last):
  File "/home/regression/regression/gstestgs.py", line 158, in runTest
    self.assertEqual(sum, gssum.get_sum(file), 'md5sum did not match baseline (' + file + ') for file: ' + self.file)
  File "/home/regression/regression/gssum.py", line 43, in get_sum
    sum = db[file]
KeyError: S2_Digitalproof-Forum_circles.pdf.pbmraw.72.1
======================================================================
ERROR: Checking S2_Digitalproof-Forum_circles.pdf (pbmraw/300dpi/noband) against baseline
----------------------------------------------------------------------
Traceback (most recent call last):
  File "/home/regression/regression/gstestgs.py", line 158, in runTest
    self.assertEqual(sum, gssum.get_sum(file), 'md5sum did not match baseline (' + file + ') for file: ' + self.file)
  File "/home/regression/regression/gssum.py", line 43, in get_sum
    sum = db[file]
KeyError: S2_Digitalproof-Forum_circles.pdf.pbmraw.300.0
======================================================================
ERROR: Checking S2_Digitalproof-Forum_circles.pdf (pbmraw/300dpi/banded) against baseline
----------------------------------------------------------------------
Traceback (most recent call last):
  File "/home/regression/regression/gstestgs.py", line 158, in runTest
    self.assertEqual(sum, gssum.get_sum(file), 'md5sum did not match baseline (' + file + ') for file: ' + self.file)
  File "/home/regression/regression/gssum.py", line 43, in get_sum
    sum = db[file]
KeyError: S2_Digitalproof-Forum_circles.pdf.pbmraw.300.1
======================================================================
ERROR: Checking S2_Digitalproof-Forum_circles.pdf (pgmraw/72dpi/noband) against baseline
----------------------------------------------------------------------
Traceback (most recent call last):
  File "/home/regression/regression/gstestgs.py", line 158, in runTest
    self.assertEqual(sum, gssum.get_sum(file), 'md5sum did not match baseline (' + file + ') for file: ' + self.file)
  File "/home/regression/regression/gssum.py", line 43, in get_sum
    sum = db[file]
KeyError: S2_Digitalproof-Forum_circles.pdf.pgmraw.72.0
======================================================================
ERROR: Checking S2_Digitalproof-Forum_circles.pdf (pgmraw/72dpi/banded) against baseline
----------------------------------------------------------------------
Traceback (most recent call last):
  File "/home/regression/regression/gstestgs.py", line 158, in runTest
    self.assertEqual(sum, gssum.get_sum(file), 'md5sum did not match baseline (' + file + ') for file: ' + self.file)
  File "/home/regression/regression/gssum.py", line 43, in get_sum
    sum = db[file]
KeyError: S2_Digitalproof-Forum_circles.pdf.pgmraw.72.1
======================================================================
ERROR: Checking S2_Digitalproof-Forum_circles.pdf (pgmraw/300dpi/noband) against baseline
----------------------------------------------------------------------
Traceback (most recent call last):
  File "/home/regression/regression/gstestgs.py", line 158, in runTest
    self.assertEqual(sum, gssum.get_sum(file), 'md5sum did not match baseline (' + file + ') for file: ' + self.file)
  File "/home/regression/regression/gssum.py", line 43, in get_sum
    sum = db[file]
KeyError: S2_Digitalproof-Forum_circles.pdf.pgmraw.300.0
======================================================================
ERROR: Checking S2_Digitalproof-Forum_circles.pdf (pgmraw/300dpi/banded) against baseline
----------------------------------------------------------------------
Traceback (most recent call last):
  File "/home/regression/regression/gstestgs.py", line 158, in runTest
    self.assertEqual(sum, gssum.get_sum(file), 'md5sum did not match baseline (' + file + ') for file: ' + self.file)
  File "/home/regression/regression/gssum.py", line 43, in get_sum
    sum = db[file]
KeyError: S2_Digitalproof-Forum_circles.pdf.pgmraw.300.1
======================================================================
ERROR: Checking S2_Digitalproof-Forum_circles.pdf (ppmraw/72dpi/noband) against baseline
----------------------------------------------------------------------
Traceback (most recent call last):
  File "/home/regression/regression/gstestgs.py", line 158, in runTest
    self.assertEqual(sum, gssum.get_sum(file), 'md5sum did not match baseline (' + file + ') for file: ' + self.file)
  File "/home/regression/regression/gssum.py", line 43, in get_sum
    sum = db[file]
KeyError: S2_Digitalproof-Forum_circles.pdf.ppmraw.72.0
======================================================================
ERROR: Checking S2_Digitalproof-Forum_circles.pdf (ppmraw/72dpi/banded) against baseline
----------------------------------------------------------------------
Traceback (most recent call last):
  File "/home/regression/regression/gstestgs.py", line 158, in runTest
    self.assertEqual(sum, gssum.get_sum(file), 'md5sum did not match baseline (' + file + ') for file: ' + self.file)
  File "/home/regression/regression/gssum.py", line 43, in get_sum
    sum = db[file]
KeyError: S2_Digitalproof-Forum_circles.pdf.ppmraw.72.1
======================================================================
ERROR: Checking S2_Digitalproof-Forum_circles.pdf (ppmraw/300dpi/noband) against baseline
----------------------------------------------------------------------
Traceback (most recent call last):
  File "/home/regression/regression/gstestgs.py", line 158, in runTest
    self.assertEqual(sum, gssum.get_sum(file), 'md5sum did not match baseline (' + file + ') for file: ' + self.file)
  File "/home/regression/regression/gssum.py", line 43, in get_sum
    sum = db[file]
KeyError: S2_Digitalproof-Forum_circles.pdf.ppmraw.300.0
======================================================================
ERROR: Checking S2_Digitalproof-Forum_circles.pdf (ppmraw/300dpi/banded) against baseline
----------------------------------------------------------------------
Traceback (most recent call last):
  File "/home/regression/regression/gstestgs.py", line 158, in runTest
    self.assertEqual(sum, gssum.get_sum(file), 'md5sum did not match baseline (' + file + ') for file: ' + self.file)
  File "/home/regression/regression/gssum.py", line 43, in get_sum
    sum = db[file]
KeyError: S2_Digitalproof-Forum_circles.pdf.ppmraw.300.1
======================================================================
ERROR: Checking S2_Digitalproof-Forum_circles.pdf (pkmraw/72dpi/noband) against baseline
----------------------------------------------------------------------
Traceback (most recent call last):
  File "/home/regression/regression/gstestgs.py", line 158, in runTest
    self.assertEqual(sum, gssum.get_sum(file), 'md5sum did not match baseline (' + file + ') for file: ' + self.file)
  File "/home/regression/regression/gssum.py", line 43, in get_sum
    sum = db[file]
KeyError: S2_Digitalproof-Forum_circles.pdf.pkmraw.72.0
======================================================================
ERROR: Checking S2_Digitalproof-Forum_circles.pdf (pkmraw/72dpi/banded) against baseline
----------------------------------------------------------------------
Traceback (most recent call last):
  File "/home/regression/regression/gstestgs.py", line 158, in runTest
    self.assertEqual(sum, gssum.get_sum(file), 'md5sum did not match baseline (' + file + ') for file: ' + self.file)
  File "/home/regression/regression/gssum.py", line 43, in get_sum
    sum = db[file]
KeyError: S2_Digitalproof-Forum_circles.pdf.pkmraw.72.1
======================================================================
ERROR: Checking S2_Digitalproof-Forum_circles.pdf (pkmraw/300dpi/noband) against baseline
----------------------------------------------------------------------
Traceback (most recent call last):
  File "/home/regression/regression/gstestgs.py", line 158, in runTest
    self.assertEqual(sum, gssum.get_sum(file), 'md5sum did not match baseline (' + file + ') for file: ' + self.file)
  File "/home/regression/regression/gssum.py", line 43, in get_sum
    sum = db[file]
KeyError: S2_Digitalproof-Forum_circles.pdf.pkmraw.300.0
======================================================================
ERROR: Checking S2_Digitalproof-Forum_circles.pdf (pkmraw/300dpi/banded) against baseline
----------------------------------------------------------------------
Traceback (most recent call last):
  File "/home/regression/regression/gstestgs.py", line 158, in runTest
    self.assertEqual(sum, gssum.get_sum(file), 'md5sum did not match baseline (' + file + ') for file: ' + self.file)
  File "/home/regression/regression/gssum.py", line 43, in get_sum
    sum = db[file]
KeyError: S2_Digitalproof-Forum_circles.pdf.pkmraw.300.1
======================================================================
ERROR: Checking ridt91.eps (pbmraw/72dpi/noband) against baseline
----------------------------------------------------------------------
Traceback (most recent call last):
  File "/home/regression/regression/gstestgs.py", line 151, in runTest
    sum = gssum.make_sum(file)
  File "/home/regression/regression/gssum.py", line 52, in make_sum
    mode = os.stat(file)[ST_MODE]
OSError: [Errno 2] No such file or directory: 'ridt91.eps.pbmraw.72.0'
======================================================================
ERROR: Checking ridt91.eps (pbmraw/72dpi/banded) against baseline
----------------------------------------------------------------------
Traceback (most recent call last):
  File "/home/regression/regression/gstestgs.py", line 151, in runTest
    sum = gssum.make_sum(file)
  File "/home/regression/regression/gssum.py", line 52, in make_sum
    mode = os.stat(file)[ST_MODE]
OSError: [Errno 2] No such file or directory: 'ridt91.eps.pbmraw.72.1'
======================================================================
ERROR: Checking ridt91.eps (pbmraw/300dpi/noband) against baseline
----------------------------------------------------------------------
Traceback (most recent call last):
  File "/home/regression/regression/gstestgs.py", line 151, in runTest
    sum = gssum.make_sum(file)
  File "/home/regression/regression/gssum.py", line 52, in make_sum
    mode = os.stat(file)[ST_MODE]
OSError: [Errno 2] No such file or directory: 'ridt91.eps.pbmraw.300.0'
======================================================================
ERROR: Checking ridt91.eps (pbmraw/300dpi/banded) against baseline
----------------------------------------------------------------------
Traceback (most recent call last):
  File "/home/regression/regression/gstestgs.py", line 151, in runTest
    sum = gssum.make_sum(file)
  File "/home/regression/regression/gssum.py", line 52, in make_sum
    mode = os.stat(file)[ST_MODE]
OSError: [Errno 2] No such file or directory: 'ridt91.eps.pbmraw.300.1'
======================================================================
ERROR: Checking ridt91.eps (pgmraw/72dpi/noband) against baseline
----------------------------------------------------------------------
Traceback (most recent call last):
  File "/home/regression/regression/gstestgs.py", line 151, in runTest
    sum = gssum.make_sum(file)
  File "/home/regression/regression/gssum.py", line 52, in make_sum
    mode = os.stat(file)[ST_MODE]
OSError: [Errno 2] No such file or directory: 'ridt91.eps.pgmraw.72.0'
======================================================================
ERROR: Checking ridt91.eps (pgmraw/72dpi/banded) against baseline
----------------------------------------------------------------------
Traceback (most recent call last):
  File "/home/regression/regression/gstestgs.py", line 151, in runTest
    sum = gssum.make_sum(file)
  File "/home/regression/regression/gssum.py", line 52, in make_sum
    mode = os.stat(file)[ST_MODE]
OSError: [Errno 2] No such file or directory: 'ridt91.eps.pgmraw.72.1'
======================================================================
ERROR: Checking ridt91.eps (pgmraw/300dpi/noband) against baseline
----------------------------------------------------------------------
Traceback (most recent call last):
  File "/home/regression/regression/gstestgs.py", line 151, in runTest
    sum = gssum.make_sum(file)
  File "/home/regression/regression/gssum.py", line 52, in make_sum
    mode = os.stat(file)[ST_MODE]
OSError: [Errno 2] No such file or directory: 'ridt91.eps.pgmraw.300.0'
======================================================================
ERROR: Checking ridt91.eps (pgmraw/300dpi/banded) against baseline
----------------------------------------------------------------------
Traceback (most recent call last):
  File "/home/regression/regression/gstestgs.py", line 151, in runTest
    sum = gssum.make_sum(file)
  File "/home/regression/regression/gssum.py", line 52, in make_sum
    mode = os.stat(file)[ST_MODE]
OSError: [Errno 2] No such file or directory: 'ridt91.eps.pgmraw.300.1'
======================================================================
ERROR: Checking ridt91.eps (ppmraw/72dpi/noband) against baseline
----------------------------------------------------------------------
Traceback (most recent call last):
  File "/home/regression/regression/gstestgs.py", line 151, in runTest
    sum = gssum.make_sum(file)
  File "/home/regression/regression/gssum.py", line 52, in make_sum
    mode = os.stat(file)[ST_MODE]
OSError: [Errno 2] No such file or directory: 'ridt91.eps.ppmraw.72.0'
======================================================================
ERROR: Checking ridt91.eps (ppmraw/72dpi/banded) against baseline
----------------------------------------------------------------------
Traceback (most recent call last):
  File "/home/regression/regression/gstestgs.py", line 151, in runTest
    sum = gssum.make_sum(file)
  File "/home/regression/regression/gssum.py", line 52, in make_sum
    mode = os.stat(file)[ST_MODE]
OSError: [Errno 2] No such file or directory: 'ridt91.eps.ppmraw.72.1'
======================================================================
ERROR: Checking ridt91.eps (ppmraw/300dpi/noband) against baseline
----------------------------------------------------------------------
Traceback (most recent call last):
  File "/home/regression/regression/gstestgs.py", line 151, in runTest
    sum = gssum.make_sum(file)
  File "/home/regression/regression/gssum.py", line 52, in make_sum
    mode = os.stat(file)[ST_MODE]
OSError: [Errno 2] No such file or directory: 'ridt91.eps.ppmraw.300.0'
======================================================================
ERROR: Checking ridt91.eps (ppmraw/300dpi/banded) against baseline
----------------------------------------------------------------------
Traceback (most recent call last):
  File "/home/regression/regression/gstestgs.py", line 151, in runTest
    sum = gssum.make_sum(file)
  File "/home/regression/regression/gssum.py", line 52, in make_sum
    mode = os.stat(file)[ST_MODE]
OSError: [Errno 2] No such file or directory: 'ridt91.eps.ppmraw.300.1'
======================================================================
ERROR: Checking ridt91.eps (pkmraw/72dpi/noband) against baseline
----------------------------------------------------------------------
Traceback (most recent call last):
  File "/home/regression/regression/gstestgs.py", line 151, in runTest
    sum = gssum.make_sum(file)
  File "/home/regression/regression/gssum.py", line 52, in make_sum
    mode = os.stat(file)[ST_MODE]
OSError: [Errno 2] No such file or directory: 'ridt91.eps.pkmraw.72.0'
======================================================================
ERROR: Checking ridt91.eps (pkmraw/72dpi/banded) against baseline
----------------------------------------------------------------------
Traceback (most recent call last):
  File "/home/regression/regression/gstestgs.py", line 151, in runTest
    sum = gssum.make_sum(file)
  File "/home/regression/regression/gssum.py", line 52, in make_sum
    mode = os.stat(file)[ST_MODE]
OSError: [Errno 2] No such file or directory: 'ridt91.eps.pkmraw.72.1'
======================================================================
ERROR: Checking ridt91.eps (pkmraw/300dpi/noband) against baseline
----------------------------------------------------------------------
Traceback (most recent call last):
  File "/home/regression/regression/gstestgs.py", line 151, in runTest
    sum = gssum.make_sum(file)
  File "/home/regression/regression/gssum.py", line 52, in make_sum
    mode = os.stat(file)[ST_MODE]
OSError: [Errno 2] No such file or directory: 'ridt91.eps.pkmraw.300.0'
======================================================================
ERROR: Checking ridt91.eps (pkmraw/300dpi/banded) against baseline
----------------------------------------------------------------------
Traceback (most recent call last):
  File "/home/regression/regression/gstestgs.py", line 151, in runTest
    sum = gssum.make_sum(file)
  File "/home/regression/regression/gssum.py", line 52, in make_sum
    mode = os.stat(file)[ST_MODE]
OSError: [Errno 2] No such file or directory: 'ridt91.eps.pkmraw.300.1'
======================================================================
FAIL: Checking Fixed_Original.pdf (pgmraw/300dpi/noband) against baseline
----------------------------------------------------------------------
md5sum did not match baseline (Fixed_Original.pdf.pgmraw.300.0) for file: /home/regression/comparefiles/Fixed_Original.pdf
======================================================================
FAIL: Checking Fixed_Original.pdf (pgmraw/300dpi/banded) against baseline
----------------------------------------------------------------------
md5sum did not match baseline (Fixed_Original.pdf.pgmraw.300.1) for file: /home/regression/comparefiles/Fixed_Original.pdf
======================================================================
FAIL: Checking Fixed_Original.pdf (ppmraw/300dpi/noband) against baseline
----------------------------------------------------------------------
md5sum did not match baseline (Fixed_Original.pdf.ppmraw.300.0) for file: /home/regression/comparefiles/Fixed_Original.pdf
======================================================================
FAIL: Checking Fixed_Original.pdf (ppmraw/300dpi/banded) against baseline
----------------------------------------------------------------------
md5sum did not match baseline (Fixed_Original.pdf.ppmraw.300.1) for file: /home/regression/comparefiles/Fixed_Original.pdf
======================================================================
FAIL: Checking Altona-Testsuite_p2_S_x3.pdf (pbmraw/72dpi/noband) against baseline
----------------------------------------------------------------------
md5sum did not match baseline (Altona-Testsuite_p2_S_x3.pdf.pbmraw.72.0) for file: /home/regression/comparefiles/Altona-Testsuite_p2_S_x3.pdf
======================================================================
FAIL: Checking Altona-Testsuite_p2_S_x3.pdf (pbmraw/72dpi/banded) against baseline
----------------------------------------------------------------------
md5sum did not match baseline (Altona-Testsuite_p2_S_x3.pdf.pbmraw.72.1) for file: /home/regression/comparefiles/Altona-Testsuite_p2_S_x3.pdf
======================================================================
FAIL: Checking Altona-Testsuite_p2_S_x3.pdf (pbmraw/300dpi/noband) against baseline
----------------------------------------------------------------------
md5sum did not match baseline (Altona-Testsuite_p2_S_x3.pdf.pbmraw.300.0) for file: /home/regression/comparefiles/Altona-Testsuite_p2_S_x3.pdf
======================================================================
FAIL: Checking Altona-Testsuite_p2_S_x3.pdf (pbmraw/300dpi/banded) against baseline
----------------------------------------------------------------------
md5sum did not match baseline (Altona-Testsuite_p2_S_x3.pdf.pbmraw.300.1) for file: /home/regression/comparefiles/Altona-Testsuite_p2_S_x3.pdf
======================================================================
FAIL: Checking Altona-Testsuite_p2_S_x3.pdf (pgmraw/72dpi/noband) against baseline
----------------------------------------------------------------------
md5sum did not match baseline (Altona-Testsuite_p2_S_x3.pdf.pgmraw.72.0) for file: /home/regression/comparefiles/Altona-Testsuite_p2_S_x3.pdf
======================================================================
FAIL: Checking Altona-Testsuite_p2_S_x3.pdf (pgmraw/72dpi/banded) against baseline
----------------------------------------------------------------------
md5sum did not match baseline (Altona-Testsuite_p2_S_x3.pdf.pgmraw.72.1) for file: /home/regression/comparefiles/Altona-Testsuite_p2_S_x3.pdf
======================================================================
FAIL: Checking Altona-Testsuite_p2_S_x3.pdf (pgmraw/300dpi/noband) against baseline
----------------------------------------------------------------------
md5sum did not match baseline (Altona-Testsuite_p2_S_x3.pdf.pgmraw.300.0) for file: /home/regression/comparefiles/Altona-Testsuite_p2_S_x3.pdf
======================================================================
FAIL: Checking Altona-Testsuite_p2_S_x3.pdf (pgmraw/300dpi/banded) against baseline
----------------------------------------------------------------------
md5sum did not match baseline (Altona-Testsuite_p2_S_x3.pdf.pgmraw.300.1) for file: /home/regression/comparefiles/Altona-Testsuite_p2_S_x3.pdf
======================================================================
FAIL: Checking Altona-Testsuite_p2_S_x3.pdf (ppmraw/72dpi/noband) against baseline
----------------------------------------------------------------------
md5sum did not match baseline (Altona-Testsuite_p2_S_x3.pdf.ppmraw.72.0) for file: /home/regression/comparefiles/Altona-Testsuite_p2_S_x3.pdf
======================================================================
FAIL: Checking Altona-Testsuite_p2_S_x3.pdf (ppmraw/72dpi/banded) against baseline
----------------------------------------------------------------------
md5sum did not match baseline (Altona-Testsuite_p2_S_x3.pdf.ppmraw.72.1) for file: /home/regression/comparefiles/Altona-Testsuite_p2_S_x3.pdf
======================================================================
FAIL: Checking Altona-Testsuite_p2_S_x3.pdf (ppmraw/300dpi/noband) against baseline
----------------------------------------------------------------------
md5sum did not match baseline (Altona-Testsuite_p2_S_x3.pdf.ppmraw.300.0) for file: /home/regression/comparefiles/Altona-Testsuite_p2_S_x3.pdf
======================================================================
FAIL: Checking Altona-Testsuite_p2_S_x3.pdf (ppmraw/300dpi/banded) against baseline
----------------------------------------------------------------------
md5sum did not match baseline (Altona-Testsuite_p2_S_x3.pdf.ppmraw.300.1) for file: /home/regression/comparefiles/Altona-Testsuite_p2_S_x3.pdf
======================================================================
FAIL: Checking Altona-Testsuite_p2_S_x3.pdf (pkmraw/72dpi/noband) against baseline
----------------------------------------------------------------------
md5sum did not match baseline (Altona-Testsuite_p2_S_x3.pdf.pkmraw.72.0) for file: /home/regression/comparefiles/Altona-Testsuite_p2_S_x3.pdf
======================================================================
FAIL: Checking Altona-Testsuite_p2_S_x3.pdf (pkmraw/72dpi/banded) against baseline
----------------------------------------------------------------------
md5sum did not match baseline (Altona-Testsuite_p2_S_x3.pdf.pkmraw.72.1) for file: /home/regression/comparefiles/Altona-Testsuite_p2_S_x3.pdf
======================================================================
FAIL: Checking Altona-Testsuite_p2_S_x3.pdf (pkmraw/300dpi/noband) against baseline
----------------------------------------------------------------------
md5sum did not match baseline (Altona-Testsuite_p2_S_x3.pdf.pkmraw.300.0) for file: /home/regression/comparefiles/Altona-Testsuite_p2_S_x3.pdf
======================================================================
FAIL: Checking Altona-Testsuite_p2_S_x3.pdf (pkmraw/300dpi/banded) against baseline
----------------------------------------------------------------------
md5sum did not match baseline (Altona-Testsuite_p2_S_x3.pdf.pkmraw.300.1) for file: /home/regression/comparefiles/Altona-Testsuite_p2_S_x3.pdf
======================================================================
FAIL: Checking Altona.Page_3.2002-09-27.pdf (pbmraw/72dpi/noband) against baseline
----------------------------------------------------------------------
md5sum did not match baseline (Altona.Page_3.2002-09-27.pdf.pbmraw.72.0) for file: /home/regression/comparefiles/Altona.Page_3.2002-09-27.pdf
======================================================================
FAIL: Checking Altona.Page_3.2002-09-27.pdf (pbmraw/72dpi/banded) against baseline
----------------------------------------------------------------------
md5sum did not match baseline (Altona.Page_3.2002-09-27.pdf.pbmraw.72.1) for file: /home/regression/comparefiles/Altona.Page_3.2002-09-27.pdf
======================================================================
FAIL: Checking Altona.Page_3.2002-09-27.pdf (pbmraw/300dpi/noband) against baseline
----------------------------------------------------------------------
md5sum did not match baseline (Altona.Page_3.2002-09-27.pdf.pbmraw.300.0) for file: /home/regression/comparefiles/Altona.Page_3.2002-09-27.pdf
======================================================================
FAIL: Checking Altona.Page_3.2002-09-27.pdf (pbmraw/300dpi/banded) against baseline
----------------------------------------------------------------------
md5sum did not match baseline (Altona.Page_3.2002-09-27.pdf.pbmraw.300.1) for file: /home/regression/comparefiles/Altona.Page_3.2002-09-27.pdf
======================================================================
FAIL: Checking Altona.Page_3.2002-09-27.pdf (pgmraw/72dpi/noband) against baseline
----------------------------------------------------------------------
md5sum did not match baseline (Altona.Page_3.2002-09-27.pdf.pgmraw.72.0) for file: /home/regression/comparefiles/Altona.Page_3.2002-09-27.pdf
======================================================================
FAIL: Checking Altona.Page_3.2002-09-27.pdf (pgmraw/72dpi/banded) against baseline
----------------------------------------------------------------------
md5sum did not match baseline (Altona.Page_3.2002-09-27.pdf.pgmraw.72.1) for file: /home/regression/comparefiles/Altona.Page_3.2002-09-27.pdf
======================================================================
FAIL: Checking Altona.Page_3.2002-09-27.pdf (pgmraw/300dpi/noband) against baseline
----------------------------------------------------------------------
md5sum did not match baseline (Altona.Page_3.2002-09-27.pdf.pgmraw.300.0) for file: /home/regression/comparefiles/Altona.Page_3.2002-09-27.pdf
======================================================================
FAIL: Checking Altona.Page_3.2002-09-27.pdf (pgmraw/300dpi/banded) against baseline
----------------------------------------------------------------------
md5sum did not match baseline (Altona.Page_3.2002-09-27.pdf.pgmraw.300.1) for file: /home/regression/comparefiles/Altona.Page_3.2002-09-27.pdf
======================================================================
FAIL: Checking Altona.Page_3.2002-09-27.pdf (ppmraw/72dpi/noband) against baseline
----------------------------------------------------------------------
md5sum did not match baseline (Altona.Page_3.2002-09-27.pdf.ppmraw.72.0) for file: /home/regression/comparefiles/Altona.Page_3.2002-09-27.pdf
======================================================================
FAIL: Checking Altona.Page_3.2002-09-27.pdf (ppmraw/72dpi/banded) against baseline
----------------------------------------------------------------------
md5sum did not match baseline (Altona.Page_3.2002-09-27.pdf.ppmraw.72.1) for file: /home/regression/comparefiles/Altona.Page_3.2002-09-27.pdf
======================================================================
FAIL: Checking Altona.Page_3.2002-09-27.pdf (ppmraw/300dpi/noband) against baseline
----------------------------------------------------------------------
md5sum did not match baseline (Altona.Page_3.2002-09-27.pdf.ppmraw.300.0) for file: /home/regression/comparefiles/Altona.Page_3.2002-09-27.pdf
======================================================================
FAIL: Checking Altona.Page_3.2002-09-27.pdf (ppmraw/300dpi/banded) against baseline
----------------------------------------------------------------------
md5sum did not match baseline (Altona.Page_3.2002-09-27.pdf.ppmraw.300.1) for file: /home/regression/comparefiles/Altona.Page_3.2002-09-27.pdf
======================================================================
FAIL: Checking Altona.Page_3.2002-09-27.pdf (pkmraw/72dpi/noband) against baseline
----------------------------------------------------------------------
md5sum did not match baseline (Altona.Page_3.2002-09-27.pdf.pkmraw.72.0) for file: /home/regression/comparefiles/Altona.Page_3.2002-09-27.pdf
======================================================================
FAIL: Checking Altona.Page_3.2002-09-27.pdf (pkmraw/72dpi/banded) against baseline
----------------------------------------------------------------------
md5sum did not match baseline (Altona.Page_3.2002-09-27.pdf.pkmraw.72.1) for file: /home/regression/comparefiles/Altona.Page_3.2002-09-27.pdf
======================================================================
FAIL: Checking Altona.Page_3.2002-09-27.pdf (pkmraw/300dpi/noband) against baseline
----------------------------------------------------------------------
md5sum did not match baseline (Altona.Page_3.2002-09-27.pdf.pkmraw.300.0) for file: /home/regression/comparefiles/Altona.Page_3.2002-09-27.pdf
======================================================================
FAIL: Checking Altona.Page_3.2002-09-27.pdf (pkmraw/300dpi/banded) against baseline
----------------------------------------------------------------------
md5sum did not match baseline (Altona.Page_3.2002-09-27.pdf.pkmraw.300.1) for file: /home/regression/comparefiles/Altona.Page_3.2002-09-27.pdf
======================================================================
FAIL: Checking S2_Digitalproof-Forum_x3k.pdf (pbmraw/72dpi/noband) against baseline
----------------------------------------------------------------------
md5sum did not match baseline (S2_Digitalproof-Forum_x3k.pdf.pbmraw.72.0) for file: /home/regression/comparefiles/S2_Digitalproof-Forum_x3k.pdf
======================================================================
FAIL: Checking S2_Digitalproof-Forum_x3k.pdf (pbmraw/72dpi/banded) against baseline
----------------------------------------------------------------------
md5sum did not match baseline (S2_Digitalproof-Forum_x3k.pdf.pbmraw.72.1) for file: /home/regression/comparefiles/S2_Digitalproof-Forum_x3k.pdf
======================================================================
FAIL: Checking S2_Digitalproof-Forum_x3k.pdf (pbmraw/300dpi/noband) against baseline
----------------------------------------------------------------------
md5sum did not match baseline (S2_Digitalproof-Forum_x3k.pdf.pbmraw.300.0) for file: /home/regression/comparefiles/S2_Digitalproof-Forum_x3k.pdf
======================================================================
FAIL: Checking S2_Digitalproof-Forum_x3k.pdf (pbmraw/300dpi/banded) against baseline
----------------------------------------------------------------------
md5sum did not match baseline (S2_Digitalproof-Forum_x3k.pdf.pbmraw.300.1) for file: /home/regression/comparefiles/S2_Digitalproof-Forum_x3k.pdf
======================================================================
FAIL: Checking S2_Digitalproof-Forum_x3k.pdf (pgmraw/72dpi/noband) against baseline
----------------------------------------------------------------------
md5sum did not match baseline (S2_Digitalproof-Forum_x3k.pdf.pgmraw.72.0) for file: /home/regression/comparefiles/S2_Digitalproof-Forum_x3k.pdf
======================================================================
FAIL: Checking S2_Digitalproof-Forum_x3k.pdf (pgmraw/72dpi/banded) against baseline
----------------------------------------------------------------------
md5sum did not match baseline (S2_Digitalproof-Forum_x3k.pdf.pgmraw.72.1) for file: /home/regression/comparefiles/S2_Digitalproof-Forum_x3k.pdf
======================================================================
FAIL: Checking S2_Digitalproof-Forum_x3k.pdf (pgmraw/300dpi/noband) against baseline
----------------------------------------------------------------------
md5sum did not match baseline (S2_Digitalproof-Forum_x3k.pdf.pgmraw.300.0) for file: /home/regression/comparefiles/S2_Digitalproof-Forum_x3k.pdf
======================================================================
FAIL: Checking S2_Digitalproof-Forum_x3k.pdf (pgmraw/300dpi/banded) against baseline
----------------------------------------------------------------------
md5sum did not match baseline (S2_Digitalproof-Forum_x3k.pdf.pgmraw.300.1) for file: /home/regression/comparefiles/S2_Digitalproof-Forum_x3k.pdf
======================================================================
FAIL: Checking S2_Digitalproof-Forum_x3k.pdf (ppmraw/72dpi/noband) against baseline
----------------------------------------------------------------------
md5sum did not match baseline (S2_Digitalproof-Forum_x3k.pdf.ppmraw.72.0) for file: /home/regression/comparefiles/S2_Digitalproof-Forum_x3k.pdf
======================================================================
FAIL: Checking S2_Digitalproof-Forum_x3k.pdf (ppmraw/72dpi/banded) against baseline
----------------------------------------------------------------------
md5sum did not match baseline (S2_Digitalproof-Forum_x3k.pdf.ppmraw.72.1) for file: /home/regression/comparefiles/S2_Digitalproof-Forum_x3k.pdf
======================================================================
FAIL: Checking S2_Digitalproof-Forum_x3k.pdf (ppmraw/300dpi/noband) against baseline
----------------------------------------------------------------------
md5sum did not match baseline (S2_Digitalproof-Forum_x3k.pdf.ppmraw.300.0) for file: /home/regression/comparefiles/S2_Digitalproof-Forum_x3k.pdf
======================================================================
FAIL: Checking S2_Digitalproof-Forum_x3k.pdf (ppmraw/300dpi/banded) against baseline
----------------------------------------------------------------------
md5sum did not match baseline (S2_Digitalproof-Forum_x3k.pdf.ppmraw.300.1) for file: /home/regression/comparefiles/S2_Digitalproof-Forum_x3k.pdf
======================================================================
FAIL: Checking S2_Digitalproof-Forum_x3k.pdf (pkmraw/72dpi/noband) against baseline
----------------------------------------------------------------------
md5sum did not match baseline (S2_Digitalproof-Forum_x3k.pdf.pkmraw.72.0) for file: /home/regression/comparefiles/S2_Digitalproof-Forum_x3k.pdf
======================================================================
FAIL: Checking S2_Digitalproof-Forum_x3k.pdf (pkmraw/72dpi/banded) against baseline
----------------------------------------------------------------------
md5sum did not match baseline (S2_Digitalproof-Forum_x3k.pdf.pkmraw.72.1) for file: /home/regression/comparefiles/S2_Digitalproof-Forum_x3k.pdf
======================================================================
FAIL: Checking S2_Digitalproof-Forum_x3k.pdf (pkmraw/300dpi/noband) against baseline
----------------------------------------------------------------------
md5sum did not match baseline (S2_Digitalproof-Forum_x3k.pdf.pkmraw.300.0) for file: /home/regression/comparefiles/S2_Digitalproof-Forum_x3k.pdf
======================================================================
FAIL: Checking S2_Digitalproof-Forum_x3k.pdf (pkmraw/300dpi/banded) against baseline
----------------------------------------------------------------------
md5sum did not match baseline (S2_Digitalproof-Forum_x3k.pdf.pkmraw.300.1) for file: /home/regression/comparefiles/S2_Digitalproof-Forum_x3k.pdf
======================================================================
FAIL: Checking Testform.v1.0.2.pdf (pbmraw/72dpi/noband) against baseline
----------------------------------------------------------------------
md5sum did not match baseline (Testform.v1.0.2.pdf.pbmraw.72.0) for file: /home/regression/comparefiles/Testform.v1.0.2.pdf
======================================================================
FAIL: Checking Testform.v1.0.2.pdf (pbmraw/72dpi/banded) against baseline
----------------------------------------------------------------------
md5sum did not match baseline (Testform.v1.0.2.pdf.pbmraw.72.1) for file: /home/regression/comparefiles/Testform.v1.0.2.pdf
======================================================================
FAIL: Checking Testform.v1.0.2.pdf (pbmraw/300dpi/noband) against baseline
----------------------------------------------------------------------
md5sum did not match baseline (Testform.v1.0.2.pdf.pbmraw.300.0) for file: /home/regression/comparefiles/Testform.v1.0.2.pdf
======================================================================
FAIL: Checking Testform.v1.0.2.pdf (pbmraw/300dpi/banded) against baseline
----------------------------------------------------------------------
md5sum did not match baseline (Testform.v1.0.2.pdf.pbmraw.300.1) for file: /home/regression/comparefiles/Testform.v1.0.2.pdf
======================================================================
FAIL: Checking Testform.v1.0.2.pdf (pgmraw/72dpi/noband) against baseline
----------------------------------------------------------------------
md5sum did not match baseline (Testform.v1.0.2.pdf.pgmraw.72.0) for file: /home/regression/comparefiles/Testform.v1.0.2.pdf
======================================================================
FAIL: Checking Testform.v1.0.2.pdf (pgmraw/72dpi/banded) against baseline
----------------------------------------------------------------------
md5sum did not match baseline (Testform.v1.0.2.pdf.pgmraw.72.1) for file: /home/regression/comparefiles/Testform.v1.0.2.pdf
======================================================================
FAIL: Checking Testform.v1.0.2.pdf (pgmraw/300dpi/noband) against baseline
----------------------------------------------------------------------
md5sum did not match baseline (Testform.v1.0.2.pdf.pgmraw.300.0) for file: /home/regression/comparefiles/Testform.v1.0.2.pdf
======================================================================
FAIL: Checking Testform.v1.0.2.pdf (pgmraw/300dpi/banded) against baseline
----------------------------------------------------------------------
md5sum did not match baseline (Testform.v1.0.2.pdf.pgmraw.300.1) for file: /home/regression/comparefiles/Testform.v1.0.2.pdf
======================================================================
FAIL: Checking Testform.v1.0.2.pdf (ppmraw/72dpi/noband) against baseline
----------------------------------------------------------------------
md5sum did not match baseline (Testform.v1.0.2.pdf.ppmraw.72.0) for file: /home/regression/comparefiles/Testform.v1.0.2.pdf
======================================================================
FAIL: Checking Testform.v1.0.2.pdf (ppmraw/72dpi/banded) against baseline
----------------------------------------------------------------------
md5sum did not match baseline (Testform.v1.0.2.pdf.ppmraw.72.1) for file: /home/regression/comparefiles/Testform.v1.0.2.pdf
======================================================================
FAIL: Checking Testform.v1.0.2.pdf (ppmraw/300dpi/noband) against baseline
----------------------------------------------------------------------
md5sum did not match baseline (Testform.v1.0.2.pdf.ppmraw.300.0) for file: /home/regression/comparefiles/Testform.v1.0.2.pdf
======================================================================
FAIL: Checking Testform.v1.0.2.pdf (ppmraw/300dpi/banded) against baseline
----------------------------------------------------------------------
md5sum did not match baseline (Testform.v1.0.2.pdf.ppmraw.300.1) for file: /home/regression/comparefiles/Testform.v1.0.2.pdf
======================================================================
FAIL: Checking Testform.v1.0.2.pdf (pkmraw/72dpi/noband) against baseline
----------------------------------------------------------------------
md5sum did not match baseline (Testform.v1.0.2.pdf.pkmraw.72.0) for file: /home/regression/comparefiles/Testform.v1.0.2.pdf
======================================================================
FAIL: Checking Testform.v1.0.2.pdf (pkmraw/72dpi/banded) against baseline
----------------------------------------------------------------------
md5sum did not match baseline (Testform.v1.0.2.pdf.pkmraw.72.1) for file: /home/regression/comparefiles/Testform.v1.0.2.pdf
======================================================================
FAIL: Checking Testform.v1.0.2.pdf (pkmraw/300dpi/noband) against baseline
----------------------------------------------------------------------
md5sum did not match baseline (Testform.v1.0.2.pdf.pkmraw.300.0) for file: /home/regression/comparefiles/Testform.v1.0.2.pdf
======================================================================
FAIL: Checking Testform.v1.0.2.pdf (pkmraw/300dpi/banded) against baseline
----------------------------------------------------------------------
md5sum did not match baseline (Testform.v1.0.2.pdf.pkmraw.300.1) for file: /home/regression/comparefiles/Testform.v1.0.2.pdf
======================================================================
FAIL: Checking Es001-01.pdf (pbmraw/72dpi/noband) against baseline
----------------------------------------------------------------------
md5sum did not match baseline (Es001-01.pdf.pbmraw.72.0) for file: /home/regression/comparefiles/Es001-01.pdf
======================================================================
FAIL: Checking Es001-01.pdf (pbmraw/72dpi/banded) against baseline
----------------------------------------------------------------------
md5sum did not match baseline (Es001-01.pdf.pbmraw.72.1) for file: /home/regression/comparefiles/Es001-01.pdf
======================================================================
FAIL: Checking Es001-01.pdf (pbmraw/300dpi/noband) against baseline
----------------------------------------------------------------------
md5sum did not match baseline (Es001-01.pdf.pbmraw.300.0) for file: /home/regression/comparefiles/Es001-01.pdf
======================================================================
FAIL: Checking Es001-01.pdf (pbmraw/300dpi/banded) against baseline
----------------------------------------------------------------------
md5sum did not match baseline (Es001-01.pdf.pbmraw.300.1) for file: /home/regression/comparefiles/Es001-01.pdf
======================================================================
FAIL: Checking Es001-01.pdf (pgmraw/72dpi/noband) against baseline
----------------------------------------------------------------------
md5sum did not match baseline (Es001-01.pdf.pgmraw.72.0) for file: /home/regression/comparefiles/Es001-01.pdf
======================================================================
FAIL: Checking Es001-01.pdf (pgmraw/72dpi/banded) against baseline
----------------------------------------------------------------------
md5sum did not match baseline (Es001-01.pdf.pgmraw.72.1) for file: /home/regression/comparefiles/Es001-01.pdf
======================================================================
FAIL: Checking Es001-01.pdf (pgmraw/300dpi/noband) against baseline
----------------------------------------------------------------------
md5sum did not match baseline (Es001-01.pdf.pgmraw.300.0) for file: /home/regression/comparefiles/Es001-01.pdf
======================================================================
FAIL: Checking Es001-01.pdf (pgmraw/300dpi/banded) against baseline
----------------------------------------------------------------------
md5sum did not match baseline (Es001-01.pdf.pgmraw.300.1) for file: /home/regression/comparefiles/Es001-01.pdf
======================================================================
FAIL: Checking Es001-01.pdf (ppmraw/72dpi/noband) against baseline
----------------------------------------------------------------------
md5sum did not match baseline (Es001-01.pdf.ppmraw.72.0) for file: /home/regression/comparefiles/Es001-01.pdf
======================================================================
FAIL: Checking Es001-01.pdf (ppmraw/72dpi/banded) against baseline
----------------------------------------------------------------------
md5sum did not match baseline (Es001-01.pdf.ppmraw.72.1) for file: /home/regression/comparefiles/Es001-01.pdf
======================================================================
FAIL: Checking Es001-01.pdf (ppmraw/300dpi/noband) against baseline
----------------------------------------------------------------------
md5sum did not match baseline (Es001-01.pdf.ppmraw.300.0) for file: /home/regression/comparefiles/Es001-01.pdf
======================================================================
FAIL: Checking Es001-01.pdf (ppmraw/300dpi/banded) against baseline
----------------------------------------------------------------------
md5sum did not match baseline (Es001-01.pdf.ppmraw.300.1) for file: /home/regression/comparefiles/Es001-01.pdf
======================================================================
FAIL: Checking Es001-01.pdf (pkmraw/72dpi/noband) against baseline
----------------------------------------------------------------------
md5sum did not match baseline (Es001-01.pdf.pkmraw.72.0) for file: /home/regression/comparefiles/Es001-01.pdf
======================================================================
FAIL: Checking Es001-01.pdf (pkmraw/72dpi/banded) against baseline
----------------------------------------------------------------------
md5sum did not match baseline (Es001-01.pdf.pkmraw.72.1) for file: /home/regression/comparefiles/Es001-01.pdf
======================================================================
FAIL: Checking Es001-01.pdf (pkmraw/300dpi/noband) against baseline
----------------------------------------------------------------------
md5sum did not match baseline (Es001-01.pdf.pkmraw.300.0) for file: /home/regression/comparefiles/Es001-01.pdf
======================================================================
FAIL: Checking Es001-01.pdf (pkmraw/300dpi/banded) against baseline
----------------------------------------------------------------------
md5sum did not match baseline (Es001-01.pdf.pkmraw.300.1) for file: /home/regression/comparefiles/Es001-01.pdf
======================================================================
FAIL: Checking annots.pdf (pbmraw/72dpi/banded) against baseline
----------------------------------------------------------------------
md5sum did not match baseline (annots.pdf.pbmraw.72.1) for file: /home/regression/comparefiles/annots.pdf
======================================================================
FAIL: Checking annots.pdf (pgmraw/72dpi/banded) against baseline
----------------------------------------------------------------------
md5sum did not match baseline (annots.pdf.pgmraw.72.1) for file: /home/regression/comparefiles/annots.pdf
======================================================================
FAIL: Checking annots.pdf (ppmraw/72dpi/banded) against baseline
----------------------------------------------------------------------
md5sum did not match baseline (annots.pdf.ppmraw.72.1) for file: /home/regression/comparefiles/annots.pdf
======================================================================
FAIL: Checking annots.pdf (pkmraw/72dpi/banded) against baseline
----------------------------------------------------------------------
md5sum did not match baseline (annots.pdf.pkmraw.72.1) for file: /home/regression/comparefiles/annots.pdf
======================================================================
FAIL: Checking pdfwrite of QA_Inv.pdf (ppmraw/72dpi/noband) against baseline
----------------------------------------------------------------------
md5sum did not match baseline (QA_Inv.pdf.pdf.ppmraw.72.0) for file: /home/regression/comparefiles/QA_Inv.pdf
======================================================================
FAIL: Checking pdfwrite of QA_Inv.pdf (ppmraw/300dpi/noband) against baseline
----------------------------------------------------------------------
md5sum did not match baseline (QA_Inv.pdf.pdf.ppmraw.300.0) for file: /home/regression/comparefiles/QA_Inv.pdf
======================================================================
FAIL: Checking pdfwrite of QA_Inv.pdf (pkmraw/300dpi/noband) against baseline
----------------------------------------------------------------------
md5sum did not match baseline (QA_Inv.pdf.pdf.pkmraw.300.0) for file: /home/regression/comparefiles/QA_Inv.pdf
======================================================================
FAIL: Checking pdfwrite of ccc.pdf (ppmraw/72dpi/noband) against baseline
----------------------------------------------------------------------
md5sum did not match baseline (ccc.pdf.pdf.ppmraw.72.0) for file: /home/regression/comparefiles/ccc.pdf
======================================================================
FAIL: Checking pdfwrite of ccc.pdf (ppmraw/300dpi/noband) against baseline
----------------------------------------------------------------------
md5sum did not match baseline (ccc.pdf.pdf.ppmraw.300.0) for file: /home/regression/comparefiles/ccc.pdf
======================================================================
FAIL: Checking pdfwrite of ccc.pdf (pkmraw/300dpi/noband) against baseline
----------------------------------------------------------------------
md5sum did not match baseline (ccc.pdf.pdf.pkmraw.300.0) for file: /home/regression/comparefiles/ccc.pdf
======================================================================
FAIL: Checking pdfwrite of gs5.98-dragon.pdf (ppmraw/72dpi/noband) against baseline
----------------------------------------------------------------------
md5sum did not match baseline (gs5.98-dragon.pdf.pdf.ppmraw.72.0) for file: /home/regression/comparefiles/gs5.98-dragon.pdf
======================================================================
FAIL: Checking pdfwrite of gs5.98-dragon.pdf (ppmraw/300dpi/noband) against baseline
----------------------------------------------------------------------
md5sum did not match baseline (gs5.98-dragon.pdf.pdf.ppmraw.300.0) for file: /home/regression/comparefiles/gs5.98-dragon.pdf
======================================================================
FAIL: Checking pdfwrite of gs5.98-dragon.pdf (pkmraw/300dpi/noband) against baseline
----------------------------------------------------------------------
md5sum did not match baseline (gs5.98-dragon.pdf.pdf.pkmraw.300.0) for file: /home/regression/comparefiles/gs5.98-dragon.pdf
======================================================================
FAIL: Checking pdfwrite of CAT_LOGO.ps (ppmraw/72dpi/noband) against baseline
----------------------------------------------------------------------
md5sum did not match baseline (CAT_LOGO.ps.pdf.ppmraw.72.0) for file: /home/regression/comparefiles/CAT_LOGO.ps
======================================================================
FAIL: Checking pdfwrite of CAT_LOGO.ps (ppmraw/300dpi/noband) against baseline
----------------------------------------------------------------------
md5sum did not match baseline (CAT_LOGO.ps.pdf.ppmraw.300.0) for file: /home/regression/comparefiles/CAT_LOGO.ps
======================================================================
FAIL: Checking pdfwrite of CAT_LOGO.ps (pkmraw/300dpi/noband) against baseline
----------------------------------------------------------------------
md5sum did not match baseline (CAT_LOGO.ps.pdf.pkmraw.300.0) for file: /home/regression/comparefiles/CAT_LOGO.ps
----------------------------------------------------------------------
Ran 7274 tests in 9851.491s

FAILED (failures=100, errors=32)