[gs-regression] gs regression report - 2002-10-31

regression@casper.ghostscript.com regression@casper.ghostscript.com
Thu, 31 Oct 2002 05:47:48 -0800


The following regression changes happened since yesterday's report:
normal S2_Digitalproof-Forum_x3k.pdf (pbmraw/300/banded)
normal S2_Digitalproof-Forum_x3k.pdf (pbmraw/300/noband)
normal S2_Digitalproof-Forum_x3k.pdf (pkmraw/300/banded)
normal S2_Digitalproof-Forum_x3k.pdf (pkmraw/300/noband)
pdfwrite 245-13.ps (pkmraw/300/noband)
pdfwrite 245-13.ps (ppmraw/300/noband)


The complete list of regressions for today:
Checking Fixed_Original.pdf (pgmraw/300dpi/noband) against baseline ... DIFFER
Checking Fixed_Original.pdf (pgmraw/300dpi/banded) against baseline ... DIFFER
Checking Fixed_Original.pdf (ppmraw/300dpi/noband) against baseline ... DIFFER
Checking Fixed_Original.pdf (ppmraw/300dpi/banded) against baseline ... DIFFER
Checking S2_Digitalproof-Forum_x3k.pdf (pbmraw/300dpi/noband) against baseline ... DIFFER
Checking S2_Digitalproof-Forum_x3k.pdf (pbmraw/300dpi/banded) against baseline ... DIFFER
Checking S2_Digitalproof-Forum_x3k.pdf (pkmraw/300dpi/noband) against baseline ... DIFFER
Checking S2_Digitalproof-Forum_x3k.pdf (pkmraw/300dpi/banded) against baseline ... DIFFER
Checking ridt91.eps (pbmraw/72dpi/noband) against baseline ... ERROR
Checking ridt91.eps (pbmraw/72dpi/banded) against baseline ... ERROR
Checking ridt91.eps (pbmraw/300dpi/noband) against baseline ... ERROR
Checking ridt91.eps (pbmraw/300dpi/banded) against baseline ... ERROR
Checking ridt91.eps (pgmraw/72dpi/noband) against baseline ... ERROR
Checking ridt91.eps (pgmraw/72dpi/banded) against baseline ... ERROR
Checking ridt91.eps (pgmraw/300dpi/noband) against baseline ... ERROR
Checking ridt91.eps (pgmraw/300dpi/banded) against baseline ... ERROR
Checking ridt91.eps (ppmraw/72dpi/noband) against baseline ... ERROR
Checking ridt91.eps (ppmraw/72dpi/banded) against baseline ... ERROR
Checking ridt91.eps (ppmraw/300dpi/noband) against baseline ... ERROR
Checking ridt91.eps (ppmraw/300dpi/banded) against baseline ... ERROR
Checking ridt91.eps (pkmraw/72dpi/noband) against baseline ... ERROR
Checking ridt91.eps (pkmraw/72dpi/banded) against baseline ... ERROR
Checking ridt91.eps (pkmraw/300dpi/noband) against baseline ... ERROR
Checking ridt91.eps (pkmraw/300dpi/banded) against baseline ... ERROR
Checking pdfwrite of 245-13.ps (ppmraw/300dpi/noband) against baseline ... DIFFER
Checking pdfwrite of 245-13.ps (pkmraw/300dpi/noband) against baseline ... DIFFER
Checking pdfwrite of QA_Inv.pdf (ppmraw/72dpi/noband) against baseline ... DIFFER
Checking pdfwrite of QA_Inv.pdf (ppmraw/300dpi/noband) against baseline ... DIFFER
Checking pdfwrite of QA_Inv.pdf (pkmraw/300dpi/noband) against baseline ... DIFFER
Checking pdfwrite of gs5.98-dragon.pdf (ppmraw/72dpi/noband) against baseline ... DIFFER
Checking pdfwrite of gs5.98-dragon.pdf (ppmraw/300dpi/noband) against baseline ... DIFFER
Checking pdfwrite of gs5.98-dragon.pdf (pkmraw/300dpi/noband) against baseline ... DIFFER
Checking pdfwrite of CAT_LOGO.ps (ppmraw/72dpi/noband) against baseline ... DIFFER
Checking pdfwrite of CAT_LOGO.ps (ppmraw/300dpi/noband) against baseline ... DIFFER
Checking pdfwrite of CAT_LOGO.ps (pkmraw/300dpi/noband) against baseline ... DIFFER

======================================================================
ERROR: Checking ridt91.eps (pbmraw/72dpi/noband) against baseline
----------------------------------------------------------------------
Traceback (most recent call last):
  File "/home/regression/regression/gstestgs.py", line 151, in runTest
    sum = gssum.make_sum(file)
  File "/home/regression/regression/gssum.py", line 52, in make_sum
    mode = os.stat(file)[ST_MODE]
OSError: [Errno 2] No such file or directory: 'ridt91.eps.pbmraw.72.0'
======================================================================
ERROR: Checking ridt91.eps (pbmraw/72dpi/banded) against baseline
----------------------------------------------------------------------
Traceback (most recent call last):
  File "/home/regression/regression/gstestgs.py", line 151, in runTest
    sum = gssum.make_sum(file)
  File "/home/regression/regression/gssum.py", line 52, in make_sum
    mode = os.stat(file)[ST_MODE]
OSError: [Errno 2] No such file or directory: 'ridt91.eps.pbmraw.72.1'
======================================================================
ERROR: Checking ridt91.eps (pbmraw/300dpi/noband) against baseline
----------------------------------------------------------------------
Traceback (most recent call last):
  File "/home/regression/regression/gstestgs.py", line 151, in runTest
    sum = gssum.make_sum(file)
  File "/home/regression/regression/gssum.py", line 52, in make_sum
    mode = os.stat(file)[ST_MODE]
OSError: [Errno 2] No such file or directory: 'ridt91.eps.pbmraw.300.0'
======================================================================
ERROR: Checking ridt91.eps (pbmraw/300dpi/banded) against baseline
----------------------------------------------------------------------
Traceback (most recent call last):
  File "/home/regression/regression/gstestgs.py", line 151, in runTest
    sum = gssum.make_sum(file)
  File "/home/regression/regression/gssum.py", line 52, in make_sum
    mode = os.stat(file)[ST_MODE]
OSError: [Errno 2] No such file or directory: 'ridt91.eps.pbmraw.300.1'
======================================================================
ERROR: Checking ridt91.eps (pgmraw/72dpi/noband) against baseline
----------------------------------------------------------------------
Traceback (most recent call last):
  File "/home/regression/regression/gstestgs.py", line 151, in runTest
    sum = gssum.make_sum(file)
  File "/home/regression/regression/gssum.py", line 52, in make_sum
    mode = os.stat(file)[ST_MODE]
OSError: [Errno 2] No such file or directory: 'ridt91.eps.pgmraw.72.0'
======================================================================
ERROR: Checking ridt91.eps (pgmraw/72dpi/banded) against baseline
----------------------------------------------------------------------
Traceback (most recent call last):
  File "/home/regression/regression/gstestgs.py", line 151, in runTest
    sum = gssum.make_sum(file)
  File "/home/regression/regression/gssum.py", line 52, in make_sum
    mode = os.stat(file)[ST_MODE]
OSError: [Errno 2] No such file or directory: 'ridt91.eps.pgmraw.72.1'
======================================================================
ERROR: Checking ridt91.eps (pgmraw/300dpi/noband) against baseline
----------------------------------------------------------------------
Traceback (most recent call last):
  File "/home/regression/regression/gstestgs.py", line 151, in runTest
    sum = gssum.make_sum(file)
  File "/home/regression/regression/gssum.py", line 52, in make_sum
    mode = os.stat(file)[ST_MODE]
OSError: [Errno 2] No such file or directory: 'ridt91.eps.pgmraw.300.0'
======================================================================
ERROR: Checking ridt91.eps (pgmraw/300dpi/banded) against baseline
----------------------------------------------------------------------
Traceback (most recent call last):
  File "/home/regression/regression/gstestgs.py", line 151, in runTest
    sum = gssum.make_sum(file)
  File "/home/regression/regression/gssum.py", line 52, in make_sum
    mode = os.stat(file)[ST_MODE]
OSError: [Errno 2] No such file or directory: 'ridt91.eps.pgmraw.300.1'
======================================================================
ERROR: Checking ridt91.eps (ppmraw/72dpi/noband) against baseline
----------------------------------------------------------------------
Traceback (most recent call last):
  File "/home/regression/regression/gstestgs.py", line 151, in runTest
    sum = gssum.make_sum(file)
  File "/home/regression/regression/gssum.py", line 52, in make_sum
    mode = os.stat(file)[ST_MODE]
OSError: [Errno 2] No such file or directory: 'ridt91.eps.ppmraw.72.0'
======================================================================
ERROR: Checking ridt91.eps (ppmraw/72dpi/banded) against baseline
----------------------------------------------------------------------
Traceback (most recent call last):
  File "/home/regression/regression/gstestgs.py", line 151, in runTest
    sum = gssum.make_sum(file)
  File "/home/regression/regression/gssum.py", line 52, in make_sum
    mode = os.stat(file)[ST_MODE]
OSError: [Errno 2] No such file or directory: 'ridt91.eps.ppmraw.72.1'
======================================================================
ERROR: Checking ridt91.eps (ppmraw/300dpi/noband) against baseline
----------------------------------------------------------------------
Traceback (most recent call last):
  File "/home/regression/regression/gstestgs.py", line 151, in runTest
    sum = gssum.make_sum(file)
  File "/home/regression/regression/gssum.py", line 52, in make_sum
    mode = os.stat(file)[ST_MODE]
OSError: [Errno 2] No such file or directory: 'ridt91.eps.ppmraw.300.0'
======================================================================
ERROR: Checking ridt91.eps (ppmraw/300dpi/banded) against baseline
----------------------------------------------------------------------
Traceback (most recent call last):
  File "/home/regression/regression/gstestgs.py", line 151, in runTest
    sum = gssum.make_sum(file)
  File "/home/regression/regression/gssum.py", line 52, in make_sum
    mode = os.stat(file)[ST_MODE]
OSError: [Errno 2] No such file or directory: 'ridt91.eps.ppmraw.300.1'
======================================================================
ERROR: Checking ridt91.eps (pkmraw/72dpi/noband) against baseline
----------------------------------------------------------------------
Traceback (most recent call last):
  File "/home/regression/regression/gstestgs.py", line 151, in runTest
    sum = gssum.make_sum(file)
  File "/home/regression/regression/gssum.py", line 52, in make_sum
    mode = os.stat(file)[ST_MODE]
OSError: [Errno 2] No such file or directory: 'ridt91.eps.pkmraw.72.0'
======================================================================
ERROR: Checking ridt91.eps (pkmraw/72dpi/banded) against baseline
----------------------------------------------------------------------
Traceback (most recent call last):
  File "/home/regression/regression/gstestgs.py", line 151, in runTest
    sum = gssum.make_sum(file)
  File "/home/regression/regression/gssum.py", line 52, in make_sum
    mode = os.stat(file)[ST_MODE]
OSError: [Errno 2] No such file or directory: 'ridt91.eps.pkmraw.72.1'
======================================================================
ERROR: Checking ridt91.eps (pkmraw/300dpi/noband) against baseline
----------------------------------------------------------------------
Traceback (most recent call last):
  File "/home/regression/regression/gstestgs.py", line 151, in runTest
    sum = gssum.make_sum(file)
  File "/home/regression/regression/gssum.py", line 52, in make_sum
    mode = os.stat(file)[ST_MODE]
OSError: [Errno 2] No such file or directory: 'ridt91.eps.pkmraw.300.0'
======================================================================
ERROR: Checking ridt91.eps (pkmraw/300dpi/banded) against baseline
----------------------------------------------------------------------
Traceback (most recent call last):
  File "/home/regression/regression/gstestgs.py", line 151, in runTest
    sum = gssum.make_sum(file)
  File "/home/regression/regression/gssum.py", line 52, in make_sum
    mode = os.stat(file)[ST_MODE]
OSError: [Errno 2] No such file or directory: 'ridt91.eps.pkmraw.300.1'
======================================================================
FAIL: Checking Fixed_Original.pdf (pgmraw/300dpi/noband) against baseline
----------------------------------------------------------------------
md5sum did not match baseline (Fixed_Original.pdf.pgmraw.300.0) for file: /home/regression/comparefiles/Fixed_Original.pdf
======================================================================
FAIL: Checking Fixed_Original.pdf (pgmraw/300dpi/banded) against baseline
----------------------------------------------------------------------
md5sum did not match baseline (Fixed_Original.pdf.pgmraw.300.1) for file: /home/regression/comparefiles/Fixed_Original.pdf
======================================================================
FAIL: Checking Fixed_Original.pdf (ppmraw/300dpi/noband) against baseline
----------------------------------------------------------------------
md5sum did not match baseline (Fixed_Original.pdf.ppmraw.300.0) for file: /home/regression/comparefiles/Fixed_Original.pdf
======================================================================
FAIL: Checking Fixed_Original.pdf (ppmraw/300dpi/banded) against baseline
----------------------------------------------------------------------
md5sum did not match baseline (Fixed_Original.pdf.ppmraw.300.1) for file: /home/regression/comparefiles/Fixed_Original.pdf
======================================================================
FAIL: Checking S2_Digitalproof-Forum_x3k.pdf (pbmraw/300dpi/noband) against baseline
----------------------------------------------------------------------
md5sum did not match baseline (S2_Digitalproof-Forum_x3k.pdf.pbmraw.300.0) for file: /home/regression/comparefiles/S2_Digitalproof-Forum_x3k.pdf
======================================================================
FAIL: Checking S2_Digitalproof-Forum_x3k.pdf (pbmraw/300dpi/banded) against baseline
----------------------------------------------------------------------
md5sum did not match baseline (S2_Digitalproof-Forum_x3k.pdf.pbmraw.300.1) for file: /home/regression/comparefiles/S2_Digitalproof-Forum_x3k.pdf
======================================================================
FAIL: Checking S2_Digitalproof-Forum_x3k.pdf (pkmraw/300dpi/noband) against baseline
----------------------------------------------------------------------
md5sum did not match baseline (S2_Digitalproof-Forum_x3k.pdf.pkmraw.300.0) for file: /home/regression/comparefiles/S2_Digitalproof-Forum_x3k.pdf
======================================================================
FAIL: Checking S2_Digitalproof-Forum_x3k.pdf (pkmraw/300dpi/banded) against baseline
----------------------------------------------------------------------
md5sum did not match baseline (S2_Digitalproof-Forum_x3k.pdf.pkmraw.300.1) for file: /home/regression/comparefiles/S2_Digitalproof-Forum_x3k.pdf
======================================================================
FAIL: Checking pdfwrite of 245-13.ps (ppmraw/300dpi/noband) against baseline
----------------------------------------------------------------------
md5sum did not match baseline (245-13.ps.pdf.ppmraw.300.0) for file: /home/regression/comparefiles/245-13.ps
======================================================================
FAIL: Checking pdfwrite of 245-13.ps (pkmraw/300dpi/noband) against baseline
----------------------------------------------------------------------
md5sum did not match baseline (245-13.ps.pdf.pkmraw.300.0) for file: /home/regression/comparefiles/245-13.ps
======================================================================
FAIL: Checking pdfwrite of QA_Inv.pdf (ppmraw/72dpi/noband) against baseline
----------------------------------------------------------------------
md5sum did not match baseline (QA_Inv.pdf.pdf.ppmraw.72.0) for file: /home/regression/comparefiles/QA_Inv.pdf
======================================================================
FAIL: Checking pdfwrite of QA_Inv.pdf (ppmraw/300dpi/noband) against baseline
----------------------------------------------------------------------
md5sum did not match baseline (QA_Inv.pdf.pdf.ppmraw.300.0) for file: /home/regression/comparefiles/QA_Inv.pdf
======================================================================
FAIL: Checking pdfwrite of QA_Inv.pdf (pkmraw/300dpi/noband) against baseline
----------------------------------------------------------------------
md5sum did not match baseline (QA_Inv.pdf.pdf.pkmraw.300.0) for file: /home/regression/comparefiles/QA_Inv.pdf
======================================================================
FAIL: Checking pdfwrite of gs5.98-dragon.pdf (ppmraw/72dpi/noband) against baseline
----------------------------------------------------------------------
md5sum did not match baseline (gs5.98-dragon.pdf.pdf.ppmraw.72.0) for file: /home/regression/comparefiles/gs5.98-dragon.pdf
======================================================================
FAIL: Checking pdfwrite of gs5.98-dragon.pdf (ppmraw/300dpi/noband) against baseline
----------------------------------------------------------------------
md5sum did not match baseline (gs5.98-dragon.pdf.pdf.ppmraw.300.0) for file: /home/regression/comparefiles/gs5.98-dragon.pdf
======================================================================
FAIL: Checking pdfwrite of gs5.98-dragon.pdf (pkmraw/300dpi/noband) against baseline
----------------------------------------------------------------------
md5sum did not match baseline (gs5.98-dragon.pdf.pdf.pkmraw.300.0) for file: /home/regression/comparefiles/gs5.98-dragon.pdf
======================================================================
FAIL: Checking pdfwrite of CAT_LOGO.ps (ppmraw/72dpi/noband) against baseline
----------------------------------------------------------------------
md5sum did not match baseline (CAT_LOGO.ps.pdf.ppmraw.72.0) for file: /home/regression/comparefiles/CAT_LOGO.ps
======================================================================
FAIL: Checking pdfwrite of CAT_LOGO.ps (ppmraw/300dpi/noband) against baseline
----------------------------------------------------------------------
md5sum did not match baseline (CAT_LOGO.ps.pdf.ppmraw.300.0) for file: /home/regression/comparefiles/CAT_LOGO.ps
======================================================================
FAIL: Checking pdfwrite of CAT_LOGO.ps (pkmraw/300dpi/noband) against baseline
----------------------------------------------------------------------
md5sum did not match baseline (CAT_LOGO.ps.pdf.pkmraw.300.0) for file: /home/regression/comparefiles/CAT_LOGO.ps
----------------------------------------------------------------------
Ran 7274 tests in 9957.216s

FAILED (failures=19, errors=16)